Show patches with: none      |   20436 patches
« 1 2 3 4204 205 »
Patch Series A/R/T S/W/F Date Submitter Delegate State
classes: add a systemd-sysext image class classes: add a systemd-sysext image class - - - --- 2024-02-22 Johannes Schneider New
[v3,3/3] classes: add a systemd-sysext image class pkg-database and systemd-sysext image - - - --- 2024-02-22 Johannes Schneider New
[v3,2/3] image.bbclass/rootfs: set and unpack package-database pkg-database and systemd-sysext image - - - --- 2024-02-22 Johannes Schneider New
[v3,1/3] image.bbclass/rootfs: archive and deploy package database pkg-database and systemd-sysext image - - - --- 2024-02-22 Johannes Schneider New
[kirkstone,v2,13/13] scripts: python 3.12 regex python 3.12 related fixes - - - --- 2024-02-21 Adrian Freihofer New
[kirkstone,v2,12/13] meta/recipes: python 3.12 regex python 3.12 related fixes - - - --- 2024-02-21 Adrian Freihofer New
[kirkstone,v2,11/13] meta/lib/oeqa: python 3.12 regex python 3.12 related fixes - - - --- 2024-02-21 Adrian Freihofer New
[kirkstone,v2,10/13] feature-microblaze-versions.inc: python 3.12 regex python 3.12 related fixes - - - --- 2024-02-21 Adrian Freihofer New
[kirkstone,v2,09/13] oeqa/selftest/oelib/buildhistory: git default branch python 3.12 related fixes - - - --- 2024-02-21 Adrian Freihofer New
[kirkstone,v2,08/13] oeqa/selftest/recipetool: expect meson.bb python 3.12 related fixes - - - --- 2024-02-21 Adrian Freihofer New
[kirkstone,v2,07/13] oeqa/selftest/recipetool: downgrade meson version to not use pyproject.toml python 3.12 related fixes - - - --- 2024-02-21 Adrian Freihofer New
[kirkstone,v2,06/13] oeqa/selftest/recipetool: fix for python 3.12 python 3.12 related fixes - - - --- 2024-02-21 Adrian Freihofer New
[kirkstone,v2,05/13] oeqa: replace deprecated assertEquals python 3.12 related fixes - - - --- 2024-02-21 Adrian Freihofer New
[kirkstone,v2,04/13] runqemu: add qmp socket support python 3.12 related fixes - - - --- 2024-02-21 Adrian Freihofer New
[kirkstone,v2,03/13] populate_sdk_ext: use ConfigParser instead of SafeConfigParser python 3.12 related fixes - - - --- 2024-02-21 Adrian Freihofer New
[kirkstone,v2,02/13] scripts/runqemu: fix regex escape sequences python 3.12 related fixes - - - --- 2024-02-21 Adrian Freihofer New
[kirkstone,v2,01/13] recipetool/create_buildsys_python: use importlib instead of imp python 3.12 related fixes - - - --- 2024-02-21 Adrian Freihofer New
linux-yocto: Remove unused patch linux-yocto: Remove unused patch - - - --- 2024-02-21 Khem Raj New
oeqa/selftest/rust: Simplify the rust testsuite output gathering/processing oeqa/selftest/rust: Simplify the rust testsuite output gathering/processing - - - --- 2024-02-21 Richard Purdie New
[RFC] Add genericarm64 MACHINE using upstream defconfig [RFC] Add genericarm64 MACHINE using upstream defconfig - - - --- 2024-02-21 Ross Burton New
systemd-systemctl: fix dead loop when multi services enable each other systemd-systemctl: fix dead loop when multi services enable each other - - - --- 2024-02-21 Xiangyu Chen New
[2/2] linux-yocto/6.6: update CVE exclusions [1/2] linux-yocto/6.6: update to v6.6.17 - - - --- 2024-02-21 Bruce Ashfield New
[1/2] linux-yocto/6.6: update to v6.6.17 [1/2] linux-yocto/6.6: update to v6.6.17 - - - --- 2024-02-21 Bruce Ashfield New
ncurses: Always pass -D_GNU_SOURCE ncurses: Always pass -D_GNU_SOURCE - - - --- 2024-02-21 Khem Raj New
[v2,1/1] qemuboot: predictable network interface names [v2,1/1] qemuboot: predictable network interface names - - - --- 2024-02-21 Slater, Joseph New
[4/4] testimage: add host disk usage stat as post action testimage: add failed test post actions and fetch more data - - - --- 2024-02-20 Alexis Lothoré New
[3/4] testimage: add target disk usage stat as post action testimage: add failed test post actions and fetch more data - - - --- 2024-02-20 Alexis Lothoré New
[2/4] testimage: isolate artifacts directory creation in dedicated post action testimage: add failed test post actions and fetch more data - - - --- 2024-02-20 Alexis Lothoré New
[1/4] testimage: create a list of failed test post actions testimage: add failed test post actions and fetch more data - - - --- 2024-02-20 Alexis Lothoré New
dbus: disable assertions and enable only modular tests dbus: disable assertions and enable only modular tests - - - --- 2024-02-20 Alexander Kanavin New
[2/2] lttng-ust: Upgrade 2.13.6 -> 2.13.7 [1/2] numactl: Upgrade 2.0.17 -> 2.0.18 - - - --- 2024-02-20 Richard Purdie New
[1/2] numactl: Upgrade 2.0.17 -> 2.0.18 [1/2] numactl: Upgrade 2.0.17 -> 2.0.18 - - - --- 2024-02-20 Richard Purdie New
testimage: log exception when failing to retrieve artifacts testimage: log exception when failing to retrieve artifacts - - - --- 2024-02-20 Alexis Lothoré New
overlayfs: add missing vardeps overlayfs: add missing vardeps - - - --- 2024-02-20 Christoph Vogtländer New
cve-check: Modify judgment processing using "=" in version comparison cve-check: Modify judgment processing using "=" in version comparison - - - --- 2024-02-20 Shinji Matsunaga New
libsdl2: upgrade 2.28.5 -> 2.30.0 libsdl2: upgrade 2.28.5 -> 2.30.0 - - - --- 2024-02-20 Yi Zhao New
bash: rebase the patch to fix ptest failure bash: rebase the patch to fix ptest failure - - - --- 2024-02-20 Xiangyu Chen New
python3-pyproject-metadata: HOMEPAGE; DESCRIPTION python3-pyproject-metadata: HOMEPAGE; DESCRIPTION - - - --- 2024-02-19 Tim Orling New
python3-pyproject-metadata: move from meta-python python3-pyproject-metadata: move from meta-python - - - --- 2024-02-19 Tim Orling New
[4/4] recipetool; add support for python_mesonpy class [1/4] python3-meson-python: move from meta-python - - - --- 2024-02-19 Tim Orling New
[3/4] python3-numpy: inherit python_mesonpy [1/4] python3-meson-python: move from meta-python - - - --- 2024-02-19 Tim Orling New
[2/4] python_mesonpy.bbclass: move from meta-python [1/4] python3-meson-python: move from meta-python - - - --- 2024-02-19 Tim Orling New
[1/4] python3-meson-python: move from meta-python [1/4] python3-meson-python: move from meta-python - - - --- 2024-02-19 Tim Orling New
[0/4] Add python_mesonpy ("mesonpy") PEP-517 backend support - - - --- 2024-02-19 Tim Orling New
[v2,5/5] devtool: code: Provide a generic C++ configuration devtool: ide: Improve VSCode support - - - --- 2024-02-19 Enguerrand de Ribaucourt New
[v2,4/5] meson: use absolute cross-compiler paths devtool: ide: Improve VSCode support - - - --- 2024-02-19 Enguerrand de Ribaucourt New
[v2,3/5] devtool: ide: vscode: Configure read-only files devtool: ide: Improve VSCode support - - - --- 2024-02-19 Enguerrand de Ribaucourt New
[v2,2/5] devtool: code: Add source mapping for debug source files devtool: ide: Improve VSCode support - - - --- 2024-02-19 Enguerrand de Ribaucourt New
[v2,1/5] devtool: ide_sdk: Use bitbake's python3 for generated scripts devtool: ide: Improve VSCode support - - - --- 2024-02-19 Enguerrand de Ribaucourt New
lib/oe/package: fix LOCALE_PATHS scan to create locale packages lib/oe/package: fix LOCALE_PATHS scan to create locale packages - - - --- 2024-02-19 Jonathan GUILLOT New
python: Drop ${PYTHON_PN} python: Drop ${PYTHON_PN} - - - --- 2024-02-19 Richard Purdie New
iproute2: add bridge package iproute2: add bridge package - - - --- 2024-02-19 M. Haener New
[PATCHv2,5/5] lib/oe/patch: Use git notes to store the filenames for the patches [PATCHv2,1/5] lib/oe/patch: Make extractPatches() not extract ignored commits - - - --- 2024-02-19 Peter Kjellerstedt New
[PATCHv2,4/5] patch.bbclass: Make use of oe.patch.GitApplyTree.commitIgnored() [PATCHv2,1/5] lib/oe/patch: Make extractPatches() not extract ignored commits - - - --- 2024-02-19 Peter Kjellerstedt New
[PATCHv2,3/5] devtool: Make use of oe.patch.GitApplyTree.commitIgnored() [PATCHv2,1/5] lib/oe/patch: Make extractPatches() not extract ignored commits - - - --- 2024-02-19 Peter Kjellerstedt New
[PATCHv2,2/5] lib/oe/patch: Add GitApplyTree.commitIgnored() [PATCHv2,1/5] lib/oe/patch: Make extractPatches() not extract ignored commits - - - --- 2024-02-19 Peter Kjellerstedt New
[PATCHv2,1/5] lib/oe/patch: Make extractPatches() not extract ignored commits [PATCHv2,1/5] lib/oe/patch: Make extractPatches() not extract ignored commits - - - --- 2024-02-19 Peter Kjellerstedt New
meta: Update CVE_STATUS for incorrect cpes meta: Update CVE_STATUS for incorrect cpes - - - --- 2024-02-18 Simone Weiß New
systemd-firstboot not triggered on read/write /etc folder systemd-firstboot not triggered on read/write /etc folder - - - --- 2024-02-18 dave.elek.96@gmail.com New
[V4] systemd: fix a dead link under /var/log [V4] systemd: fix a dead link under /var/log - - - --- 2024-02-18 Changqing Li New
wic: allow sizes to be specified in sectors wic: allow sizes to be specified in sectors - - - --- 2024-02-17 Trevor Woerner New
[7/7] lib/oe/patch: Use git notes to store the filenames for the patches [1/7] devtool: standard: Add some missing whitespace - - - --- 2024-02-16 Peter Kjellerstedt New
[6/7] patch.bbclass: Make use of oe.patch.GitApplyTree.commitIgnored() [1/7] devtool: standard: Add some missing whitespace - - - --- 2024-02-16 Peter Kjellerstedt New
[5/7] devtool: Make use of oe.patch.GitApplyTree.commitIgnored() [1/7] devtool: standard: Add some missing whitespace - - - --- 2024-02-16 Peter Kjellerstedt New
[4/7] lib/oe/patch: Add GitApplyTree.commitIgnored() [1/7] devtool: standard: Add some missing whitespace - - - --- 2024-02-16 Peter Kjellerstedt New
[3/7] lib/oe/patch: Make extractPatches() not extract ignored commits [1/7] devtool: standard: Add some missing whitespace - - - --- 2024-02-16 Peter Kjellerstedt New
appstream: update 1.0.0 -> 1.0.1 appstream: update 1.0.0 -> 1.0.1 - - - --- 2024-02-16 Markus Volk New
[3/3] bitbake: git-make-shallow: support git's safe.bareRepository support git's safe.bareRepository=explicit - - - --- 2024-02-16 André Draszik New
[2/3] bitbake: tests/fetch: support git's safe.bareRepository support git's safe.bareRepository=explicit - - - --- 2024-02-16 André Draszik New
[1/3] bitbake: fetch/git2: support git's safe.bareRepository support git's safe.bareRepository=explicit - - - --- 2024-02-16 André Draszik New
kernel-devsrc: Improve vdso-offsets handling kernel-devsrc: Improve vdso-offsets handling - - - --- 2024-02-16 Richard Purdie New
[2/9] minicom: upgrade 2.8 -> 2.9 [1/9] enchant2: upgrade 2.6.5 -> 2.6.7 - - - --- 2024-02-16 Mittal, Anuj New
[AUH] webkitgtk: upgrading to 2.42.5 SUCCEEDED [AUH] webkitgtk: upgrading to 2.42.5 SUCCEEDED - - - --- 2024-02-15 auh@yoctoproject.org New
[AUH] acl: upgrading to 2.3.2 SUCCEEDED [AUH] acl: upgrading to 2.3.2 SUCCEEDED - - - --- 2024-02-15 auh@yoctoproject.org New
[AUH] boost: upgrading to 1.84.0 SUCCEEDED [AUH] boost: upgrading to 1.84.0 SUCCEEDED - - - --- 2024-02-15 auh@yoctoproject.org New
[AUH] enchant2: upgrading to 2.6.7 SUCCEEDED [AUH] enchant2: upgrading to 2.6.7 SUCCEEDED - - - --- 2024-02-15 auh@yoctoproject.org New
[AUH] libproxy: upgrading to 0.5.4 SUCCEEDED [AUH] libproxy: upgrading to 0.5.4 SUCCEEDED - - - --- 2024-02-15 auh@yoctoproject.org New
[AUH] appstream: upgrading to 1.0.1 SUCCEEDED [AUH] appstream: upgrading to 1.0.1 SUCCEEDED - - - --- 2024-02-15 auh@yoctoproject.org New
[AUH] taglib: upgrading to 2.0 FAILED [AUH] taglib: upgrading to 2.0 FAILED - - - --- 2024-02-15 auh@yoctoproject.org New
[AUH] numactl: upgrading to 2.0.18 SUCCEEDED [AUH] numactl: upgrading to 2.0.18 SUCCEEDED - - - --- 2024-02-15 auh@yoctoproject.org New
[AUH] libgit2: upgrading to 1.7.2 SUCCEEDED [AUH] libgit2: upgrading to 1.7.2 SUCCEEDED - - - --- 2024-02-15 auh@yoctoproject.org New
[AUH] libmicrohttpd: upgrading to 1.0.0 SUCCEEDED [AUH] libmicrohttpd: upgrading to 1.0.0 SUCCEEDED - - - --- 2024-02-15 auh@yoctoproject.org New
[AUH] ptest-runner: upgrading to 2.4.3 SUCCEEDED [AUH] ptest-runner: upgrading to 2.4.3 SUCCEEDED - - - --- 2024-02-15 auh@yoctoproject.org New
[AUH] libusb1: upgrading to 1.0.27 FAILED [AUH] libusb1: upgrading to 1.0.27 FAILED - - - --- 2024-02-15 auh@yoctoproject.org New
[AUH] diffoscope: upgrading to 257 SUCCEEDED [AUH] diffoscope: upgrading to 257 SUCCEEDED - - - --- 2024-02-15 auh@yoctoproject.org New
[AUH] puzzles: upgrading to 7a93ae5d3c90cb5d1d8d775a8cd9d30bc745f658 SUCCEEDED [AUH] puzzles: upgrading to 7a93ae5d3c90cb5d1d8d775a8cd9d30bc745f658 SUCCEEDED - - - --- 2024-02-15 auh@yoctoproject.org New
[AUH] gstreamer1.0-vaapi: upgrading to 1.22.10 SUCCEEDED [AUH] gstreamer1.0-vaapi: upgrading to 1.22.10 SUCCEEDED - - - --- 2024-02-15 auh@yoctoproject.org New
[AUH] gstreamer1.0: upgrading to 1.22.10 FAILED [AUH] gstreamer1.0: upgrading to 1.22.10 FAILED - - - --- 2024-02-15 auh@yoctoproject.org New
[AUH] vulkan-headers: upgrading to 1.3.275.0 SUCCEEDED [AUH] vulkan-headers: upgrading to 1.3.275.0 SUCCEEDED - - - --- 2024-02-15 auh@yoctoproject.org New
[AUH] pango: upgrading to 1.51.2 SUCCEEDED [AUH] pango: upgrading to 1.51.2 SUCCEEDED - - - --- 2024-02-15 auh@yoctoproject.org New
[AUH] spirv-tools: upgrading to 1.3.275.0 SUCCEEDED [AUH] spirv-tools: upgrading to 1.3.275.0 SUCCEEDED - - - --- 2024-02-15 auh@yoctoproject.org New
[AUH] libxkbfile: upgrading to 1.1.3 SUCCEEDED [AUH] libxkbfile: upgrading to 1.1.3 SUCCEEDED - - - --- 2024-02-15 auh@yoctoproject.org New
[AUH] xkeyboard-config: upgrading to 2.41 SUCCEEDED [AUH] xkeyboard-config: upgrading to 2.41 SUCCEEDED - - - --- 2024-02-15 auh@yoctoproject.org New
[AUH] gstreamer1.0-rtsp-server: upgrading to 1.22.10 SUCCEEDED [AUH] gstreamer1.0-rtsp-server: upgrading to 1.22.10 SUCCEEDED - - - --- 2024-02-15 auh@yoctoproject.org New
[AUH] gstreamer1.0-python: upgrading to 1.22.10 SUCCEEDED [AUH] gstreamer1.0-python: upgrading to 1.22.10 SUCCEEDED - - - --- 2024-02-15 auh@yoctoproject.org New
[AUH] xkbcomp: upgrading to 1.4.7 SUCCEEDED [AUH] xkbcomp: upgrading to 1.4.7 SUCCEEDED - - - --- 2024-02-15 auh@yoctoproject.org New
[AUH] libpciaccess: upgrading to 0.18 FAILED [AUH] libpciaccess: upgrading to 0.18 FAILED - - - --- 2024-02-15 auh@yoctoproject.org New
[AUH] libxvmc: upgrading to 1.0.14 SUCCEEDED [AUH] libxvmc: upgrading to 1.0.14 SUCCEEDED - - - --- 2024-02-15 auh@yoctoproject.org New
[AUH] gstreamer1.0-libav: upgrading to 1.22.10 SUCCEEDED [AUH] gstreamer1.0-libav: upgrading to 1.22.10 SUCCEEDED - - - --- 2024-02-15 auh@yoctoproject.org New
[AUH] vulkan-loader: upgrading to 1.3.275.0 FAILED [AUH] vulkan-loader: upgrading to 1.3.275.0 FAILED - - - --- 2024-02-15 auh@yoctoproject.org New
« 1 2 3 4204 205 »