Show patches with: Archived = No       |   8635 patches
« 1 2 3 486 87 »
Patch Series A/R/T S/W/F Date Submitter Delegate State
systemd: Replace deprecate udevadm command systemd: Replace deprecate udevadm command - - - --- 2024-07-17 Khem Raj New
[4/4] devtool/upgrade: use PN instead of BPN for naming newly created upgraded recipes [1/4] lib/oe/recipeutils: return a dict in get_recipe_upgrade_status() instead of a tuple - - - --- 2024-07-17 Alexander Kanavin New
[3/4] recipeutils/get_recipe_upgrade_status: group recipes when they need to be upgraded together [1/4] lib/oe/recipeutils: return a dict in get_recipe_upgrade_status() instead of a tuple - - - --- 2024-07-17 Alexander Kanavin New
[2/4] lib/recipeutils: add a function to determine recipes with shared include files [1/4] lib/oe/recipeutils: return a dict in get_recipe_upgrade_status() instead of a tuple - - - --- 2024-07-17 Alexander Kanavin New
[1/4] lib/oe/recipeutils: return a dict in get_recipe_upgrade_status() instead of a tuple [1/4] lib/oe/recipeutils: return a dict in get_recipe_upgrade_status() instead of a tuple - - - --- 2024-07-17 Alexander Kanavin New
[v2] nativesdk-libtool: sanitize the script, remove buildpaths [v2] nativesdk-libtool: sanitize the script, remove buildpaths - - - --- 2024-07-17 Denys Dmytriyenko New
python3-setuptools: upgrade 69.5.1 -> 70.3.0 python3-setuptools: upgrade 69.5.1 -> 70.3.0 - - - --- 2024-07-17 Trevor Gamblin New
[2/2] systemd: Move the MIME file to a separate package [1/2] systemd: Correct the indentation in do_install() - - - --- 2024-07-17 Peter Kjellerstedt New
[1/2] systemd: Correct the indentation in do_install() [1/2] systemd: Correct the indentation in do_install() - - - --- 2024-07-17 Peter Kjellerstedt New
oeqa/postactions: Separate artefact collection from test result collection oeqa/postactions: Separate artefact collection from test result collection - - - --- 2024-07-17 Richard Purdie New
[v2] testimage: Fix TESTIMAGE_FAILED_QA_ARTIFACTS setting [v2] testimage: Fix TESTIMAGE_FAILED_QA_ARTIFACTS setting - - - --- 2024-07-17 Richard Purdie New
oeqa/runtime/scp: requires openssh-sftp-server oeqa/runtime/scp: requires openssh-sftp-server - - - --- 2024-07-17 Jose Quaresma New
testimage/core-image-ptest: Move TESTIMAGE_FAILED_QA_ARTIFACTS setting to image recipe testimage/core-image-ptest: Move TESTIMAGE_FAILED_QA_ARTIFACTS setting to image recipe - - - --- 2024-07-17 Richard Purdie New
Revert "testimage: retrieve ptests directory when ptests fail" Revert "testimage: retrieve ptests directory when ptests fail" - - - --- 2024-07-17 Jose Quaresma New
[v2] gcc: remove paths to sysroot from configargs.h and checksum-options for gcc-cross-canadian [v2] gcc: remove paths to sysroot from configargs.h and checksum-options for gcc-cross-canadian - - - --- 2024-07-17 Oleksandr Hnatiuk New
systemd: fix VERSION_TAG related build error systemd: fix VERSION_TAG related build error - - - --- 2024-07-17 Kai New
[v2] llvm: extend llvm-config reproducivility fix to nativesdk class [v2] llvm: extend llvm-config reproducivility fix to nativesdk class - - - --- 2024-07-16 Denys Dmytriyenko New
nativesdk-libtool: sanitize the script, remove buildpaths nativesdk-libtool: sanitize the script, remove buildpaths - - - --- 2024-07-16 Denys Dmytriyenko New
[v2] bluez5: cleanup redundant backslashes [v2] bluez5: cleanup redundant backslashes - - - --- 2024-07-16 Guðni Már Gilbert New
bluez5: cleanup redundant backslashes bluez5: cleanup redundant backslashes - - - --- 2024-07-16 Guðni Már Gilbert New
openssl: disable tests unless ptest is enabled openssl: disable tests unless ptest is enabled - - - --- 2024-07-16 Ross Burton New
bluez5: drop modifications to Python shebangs bluez5: drop modifications to Python shebangs - - - --- 2024-07-16 Guðni Már Gilbert New
[v5,3/3] openssh: upgrade 9.7p1 -> 9.8p1 [v5,1/3] openssh: drop rejected patch fixed in 8.6p1 release - - - --- 2024-07-16 Jose Quaresma New
[v5,2/3] openssh: systemd notification was implemented upstream [v5,1/3] openssh: drop rejected patch fixed in 8.6p1 release - - - --- 2024-07-16 Jose Quaresma New
[v5,1/3] openssh: drop rejected patch fixed in 8.6p1 release [v5,1/3] openssh: drop rejected patch fixed in 8.6p1 release - - - --- 2024-07-16 Jose Quaresma New
[v3] mesa: fix QA warnings caused by freedreno tools [v3] mesa: fix QA warnings caused by freedreno tools - - - --- 2024-07-16 Dmitry Baryshkov New
[master,V2] pixman: update patch for fixing inline failure with -Og [master,V2] pixman: update patch for fixing inline failure with -Og - - - --- 2024-07-16 Changqing Li New
[v4,3/3] openssh: upgrade 9.7p1 -> 9.8p1 [v4,1/3] openssh: drop rejected patch fixed in 8.6p1 release - - - --- 2024-07-16 Jose Quaresma New
[v4,2/3] openssh: systemd sd-notify patch was rejected upstream [v4,1/3] openssh: drop rejected patch fixed in 8.6p1 release - - - --- 2024-07-16 Jose Quaresma New
[v4,1/3] openssh: drop rejected patch fixed in 8.6p1 release [v4,1/3] openssh: drop rejected patch fixed in 8.6p1 release - - - --- 2024-07-16 Jose Quaresma New
llvm: extend llvm-config reproducivility fix to all classes llvm: extend llvm-config reproducivility fix to all classes - - - --- 2024-07-16 Denys Dmytriyenko New
[v2] mesa: fix QA warnings caused by freedreno tools [v2] mesa: fix QA warnings caused by freedreno tools - - - --- 2024-07-15 Dmitry Baryshkov New
mesa: fix QA warnings caused by freedreno tools mesa: fix QA warnings caused by freedreno tools - - - --- 2024-07-15 Dmitry Baryshkov New
classes-recipe/multilib_script: Expand before splitting classes-recipe/multilib_script: Expand before splitting - - - --- 2024-07-15 Joshua Watt New
[2/2] package.bbclass: Add ALL_MULTILIB_SSTATE_ARCHS Fix SPDX processing with AMD toolchain building - - - --- 2024-07-15 Mark Hatle New
[1/2] create-sdpx-2.2.bbclass: Switch from exists to isfile checking debugsrc Fix SPDX processing with AMD toolchain building - - - --- 2024-07-15 Mark Hatle New
[AUH] libproxy: upgrading to 0.5.7 SUCCEEDED [AUH] libproxy: upgrading to 0.5.7 SUCCEEDED - - - --- 2024-07-15 auh@yoctoproject.org New
[AUH] gdbm: upgrading to 1.24 SUCCEEDED [AUH] gdbm: upgrading to 1.24 SUCCEEDED - - - --- 2024-07-15 auh@yoctoproject.org New
[AUH] nghttp2: upgrading to 1.62.1 SUCCEEDED [AUH] nghttp2: upgrading to 1.62.1 SUCCEEDED - - - --- 2024-07-15 auh@yoctoproject.org New
[AUH] gnupg: upgrading to 2.5.0 FAILED [AUH] gnupg: upgrading to 2.5.0 FAILED - - - --- 2024-07-15 auh@yoctoproject.org New
[AUH] diffoscope: upgrading to 272 SUCCEEDED [AUH] diffoscope: upgrading to 272 SUCCEEDED - - - --- 2024-07-15 auh@yoctoproject.org New
[AUH] libxslt: upgrading to 1.1.42 FAILED [AUH] libxslt: upgrading to 1.1.42 FAILED - - - --- 2024-07-15 auh@yoctoproject.org New
[AUH] puzzles: upgrading to fd304c53cc45dc05b3f95c20a466e20a7e1c9194 SUCCEEDED [AUH] puzzles: upgrading to fd304c53cc45dc05b3f95c20a466e20a7e1c9194 SUCCEEDED - - - --- 2024-07-15 auh@yoctoproject.org New
[AUH] vte: upgrading to 0.76.3 FAILED [AUH] vte: upgrading to 0.76.3 FAILED - - - --- 2024-07-15 auh@yoctoproject.org New
[AUH] gstreamer1.0-libav: upgrading to 1.24.5 SUCCEEDED [AUH] gstreamer1.0-libav: upgrading to 1.24.5 SUCCEEDED - - - --- 2024-07-15 auh@yoctoproject.org New
[AUH] gst-devtools: upgrading to 1.24.5 SUCCEEDED [AUH] gst-devtools: upgrading to 1.24.5 SUCCEEDED - - - --- 2024-07-15 auh@yoctoproject.org New
[AUH] gstreamer1.0-plugins-ugly: upgrading to 1.24.5 SUCCEEDED [AUH] gstreamer1.0-plugins-ugly: upgrading to 1.24.5 SUCCEEDED - - - --- 2024-07-15 auh@yoctoproject.org New
[AUH] debianutils: upgrading to 5.20 SUCCEEDED [AUH] debianutils: upgrading to 5.20 SUCCEEDED - - - --- 2024-07-15 auh@yoctoproject.org New
[AUH] gstreamer1.0-rtsp-server: upgrading to 1.24.5 SUCCEEDED [AUH] gstreamer1.0-rtsp-server: upgrading to 1.24.5 SUCCEEDED - - - --- 2024-07-15 auh@yoctoproject.org New
[AUH] wireless-regdb: upgrading to 2024.07.04 SUCCEEDED [AUH] wireless-regdb: upgrading to 2024.07.04 SUCCEEDED - - - --- 2024-07-15 auh@yoctoproject.org New
[AUH] alsa-utils: upgrading to 1.2.12 FAILED [AUH] alsa-utils: upgrading to 1.2.12 FAILED - - - --- 2024-07-15 auh@yoctoproject.org New
[AUH] gstreamer1.0-python: upgrading to 1.24.5 SUCCEEDED [AUH] gstreamer1.0-python: upgrading to 1.24.5 SUCCEEDED - - - --- 2024-07-15 auh@yoctoproject.org New
[AUH] weston: upgrading to 13.0.3 SUCCEEDED [AUH] weston: upgrading to 13.0.3 SUCCEEDED - - - --- 2024-07-15 auh@yoctoproject.org New
[AUH] gstreamer1.0-vaapi: upgrading to 1.24.5 SUCCEEDED [AUH] gstreamer1.0-vaapi: upgrading to 1.24.5 SUCCEEDED - - - --- 2024-07-15 auh@yoctoproject.org New
[AUH] gstreamer1.0-plugins-good: upgrading to 1.24.5 SUCCEEDED [AUH] gstreamer1.0-plugins-good: upgrading to 1.24.5 SUCCEEDED - - - --- 2024-07-15 auh@yoctoproject.org New
[AUH] gstreamer1.0: upgrading to 1.24.5 SUCCEEDED [AUH] gstreamer1.0: upgrading to 1.24.5 SUCCEEDED - - - --- 2024-07-15 auh@yoctoproject.org New
[AUH] sqlite3: upgrading to 3.46.0 SUCCEEDED [AUH] sqlite3: upgrading to 3.46.0 SUCCEEDED - - - --- 2024-07-15 auh@yoctoproject.org New
[AUH] pinentry: upgrading to 1.3.1 SUCCEEDED [AUH] pinentry: upgrading to 1.3.1 SUCCEEDED - - - --- 2024-07-15 auh@yoctoproject.org New
[AUH] gnutls: upgrading to 3.8.6 SUCCEEDED [AUH] gnutls: upgrading to 3.8.6 SUCCEEDED - - - --- 2024-07-15 auh@yoctoproject.org New
[AUH] gstreamer1.0-plugins-base: upgrading to 1.24.5 SUCCEEDED [AUH] gstreamer1.0-plugins-base: upgrading to 1.24.5 SUCCEEDED - - - --- 2024-07-15 auh@yoctoproject.org New
[AUH] xwayland: upgrading to 24.1.1 SUCCEEDED [AUH] xwayland: upgrading to 24.1.1 SUCCEEDED - - - --- 2024-07-15 auh@yoctoproject.org New
[AUH] linux-firmware: upgrading to 20240709 SUCCEEDED [AUH] linux-firmware: upgrading to 20240709 SUCCEEDED - - - --- 2024-07-15 auh@yoctoproject.org New
[AUH] xkeyboard-config: upgrading to 2.42 SUCCEEDED [AUH] xkeyboard-config: upgrading to 2.42 SUCCEEDED - - - --- 2024-07-15 auh@yoctoproject.org New
[AUH] libsdl2: upgrading to 2.30.5 SUCCEEDED [AUH] libsdl2: upgrading to 2.30.5 SUCCEEDED - - - --- 2024-07-15 auh@yoctoproject.org New
[AUH] libsolv: upgrading to 0.7.30 SUCCEEDED [AUH] libsolv: upgrading to 0.7.30 SUCCEEDED - - - --- 2024-07-15 auh@yoctoproject.org New
[AUH] kmscube: upgrading to 467e86c5cbeb2a2051b31ce2c240d6ddf5bc3112 SUCCEEDED [AUH] kmscube: upgrading to 467e86c5cbeb2a2051b31ce2c240d6ddf5bc3112 SUCCEEDED - - - --- 2024-07-15 auh@yoctoproject.org New
[AUH] gtk+3: upgrading to 3.24.43 FAILED [AUH] gtk+3: upgrading to 3.24.43 FAILED - - - --- 2024-07-15 auh@yoctoproject.org New
[AUH] adwaita-icon-theme: upgrading to 46.2 FAILED [AUH] adwaita-icon-theme: upgrading to 46.2 FAILED - - - --- 2024-07-15 auh@yoctoproject.org New
[AUH] libva: upgrading to 2.22.0 SUCCEEDED [AUH] libva: upgrading to 2.22.0 SUCCEEDED - - - --- 2024-07-15 auh@yoctoproject.org New
[AUH] libva-initial: upgrading to 2.22.0 FAILED [AUH] libva-initial: upgrading to 2.22.0 FAILED - - - --- 2024-07-15 auh@yoctoproject.org New
[AUH] xz: upgrading to 5.6.2 SUCCEEDED [AUH] xz: upgrading to 5.6.2 SUCCEEDED - - - --- 2024-07-15 auh@yoctoproject.org New
[AUH] xmlto: upgrading to 635dcd5bc84a7b67a3a2050a179d96e1d3050b15 FAILED [AUH] xmlto: upgrading to 635dcd5bc84a7b67a3a2050a179d96e1d3050b15 FAILED - - - --- 2024-07-15 auh@yoctoproject.org New
[AUH] hicolor-icon-theme: upgrading to 0.18 FAILED [AUH] hicolor-icon-theme: upgrading to 0.18 FAILED - - - --- 2024-07-15 auh@yoctoproject.org New
[AUH] libadwaita: upgrading to 1.5.2 SUCCEEDED [AUH] libadwaita: upgrading to 1.5.2 SUCCEEDED - - - --- 2024-07-15 auh@yoctoproject.org New
[AUH] sysstat: upgrading to 12.7.6 SUCCEEDED [AUH] sysstat: upgrading to 12.7.6 SUCCEEDED - - - --- 2024-07-15 auh@yoctoproject.org New
[AUH] stress-ng: upgrading to 0.18.01 SUCCEEDED [AUH] stress-ng: upgrading to 0.18.01 SUCCEEDED - - - --- 2024-07-15 auh@yoctoproject.org New
[AUH] ethtool: upgrading to 6.9 SUCCEEDED [AUH] ethtool: upgrading to 6.9 SUCCEEDED - - - --- 2024-07-15 auh@yoctoproject.org New
[AUH] gi-docgen: upgrading to 2024.1 SUCCEEDED [AUH] gi-docgen: upgrading to 2024.1 SUCCEEDED - - - --- 2024-07-15 auh@yoctoproject.org New
[AUH] cups: upgrading to 2.4.10 SUCCEEDED [AUH] cups: upgrading to 2.4.10 SUCCEEDED - - - --- 2024-07-15 auh@yoctoproject.org New
[AUH] shadow: upgrading to 4.16.0 FAILED [AUH] shadow: upgrading to 4.16.0 FAILED - - - --- 2024-07-15 auh@yoctoproject.org New
[AUH] harfbuzz: upgrading to 9.0.0 SUCCEEDED [AUH] harfbuzz: upgrading to 9.0.0 SUCCEEDED - - - --- 2024-07-15 auh@yoctoproject.org New
[AUH] librsvg: upgrading to 2.58.2 SUCCEEDED [AUH] librsvg: upgrading to 2.58.2 SUCCEEDED - - - --- 2024-07-15 auh@yoctoproject.org New
[AUH] libdrm: upgrading to 2.4.122 SUCCEEDED [AUH] libdrm: upgrading to 2.4.122 SUCCEEDED - - - --- 2024-07-15 auh@yoctoproject.org New
[AUH] epiphany: upgrading to 46.2 SUCCEEDED [AUH] epiphany: upgrading to 46.2 SUCCEEDED - - - --- 2024-07-15 auh@yoctoproject.org New
[AUH] python3-dtschema: upgrading to 2024.5 SUCCEEDED [AUH] python3-dtschema: upgrading to 2024.5 SUCCEEDED - - - --- 2024-07-15 auh@yoctoproject.org New
[AUH] python3-uritools: upgrading to 4.0.3 SUCCEEDED [AUH] python3-uritools: upgrading to 4.0.3 SUCCEEDED - - - --- 2024-07-15 auh@yoctoproject.org New
[AUH] python3-dbusmock: upgrading to 0.32.1 SUCCEEDED [AUH] python3-dbusmock: upgrading to 0.32.1 SUCCEEDED - - - --- 2024-07-15 auh@yoctoproject.org New
[AUH] python3-webcolors: upgrading to 24.6.0 SUCCEEDED [AUH] python3-webcolors: upgrading to 24.6.0 SUCCEEDED - - - --- 2024-07-15 auh@yoctoproject.org New
[AUH] python3-jsonpointer: upgrading to 3.0.0 SUCCEEDED [AUH] python3-jsonpointer: upgrading to 3.0.0 SUCCEEDED - - - --- 2024-07-15 auh@yoctoproject.org New
[AUH] mtools: upgrading to 4.0.44 SUCCEEDED [AUH] mtools: upgrading to 4.0.44 SUCCEEDED - - - --- 2024-07-15 auh@yoctoproject.org New
[AUH] python3-hypothesis: upgrading to 6.108.2 SUCCEEDED [AUH] python3-hypothesis: upgrading to 6.108.2 SUCCEEDED - - - --- 2024-07-15 auh@yoctoproject.org New
[AUH] python3-jsonschema: upgrading to 4.23.0 SUCCEEDED [AUH] python3-jsonschema: upgrading to 4.23.0 SUCCEEDED - - - --- 2024-07-15 auh@yoctoproject.org New
[AUH] python3-certifi: upgrading to 2024.7.4 SUCCEEDED [AUH] python3-certifi: upgrading to 2024.7.4 SUCCEEDED - - - --- 2024-07-15 auh@yoctoproject.org New
[AUH] python3-hatchling: upgrading to 1.25.0 SUCCEEDED [AUH] python3-hatchling: upgrading to 1.25.0 SUCCEEDED - - - --- 2024-07-15 auh@yoctoproject.org New
[AUH] python3-sphinx: upgrading to 7.4.0 SUCCEEDED [AUH] python3-sphinx: upgrading to 7.4.0 SUCCEEDED - - - --- 2024-07-15 auh@yoctoproject.org New
[AUH] python3-importlib-metadata: upgrading to 8.0.0 SUCCEEDED [AUH] python3-importlib-metadata: upgrading to 8.0.0 SUCCEEDED - - - --- 2024-07-15 auh@yoctoproject.org New
[AUH] python3-numpy: upgrading to 2.0.0 FAILED [AUH] python3-numpy: upgrading to 2.0.0 FAILED - - - --- 2024-07-15 auh@yoctoproject.org New
[AUH] python3-rpds-py: upgrading to 0.19.0 FAILED [AUH] python3-rpds-py: upgrading to 0.19.0 FAILED - - - --- 2024-07-15 auh@yoctoproject.org New
[AUH] python3-maturin: upgrading to 1.7.0 SUCCEEDED [AUH] python3-maturin: upgrading to 1.7.0 SUCCEEDED - - - --- 2024-07-15 auh@yoctoproject.org New
[AUH] repo: upgrading to 2.46 SUCCEEDED [AUH] repo: upgrading to 2.46 SUCCEEDED - - - --- 2024-07-15 auh@yoctoproject.org New
« 1 2 3 486 87 »