Show patches with: Archived = No       |   7765 patches
« 1 2 3 477 78 »
Patch Series A/R/T S/W/F Date Submitter Delegate State
[AUH] libva: upgrading to 2.21.0 FAILED [AUH] libva: upgrading to 2.21.0 FAILED - - - --- 2024-05-15 auh@yoctoproject.org New
[AUH] xmlto: upgrading to 635dcd5bc84a7b67a3a2050a179d96e1d3050b15 FAILED [AUH] xmlto: upgrading to 635dcd5bc84a7b67a3a2050a179d96e1d3050b15 FAILED - - - --- 2024-05-15 auh@yoctoproject.org New
[AUH] gdk-pixbuf: upgrading to 2.42.12 SUCCEEDED [AUH] gdk-pixbuf: upgrading to 2.42.12 SUCCEEDED - - - --- 2024-05-15 auh@yoctoproject.org Under Review
[AUH] cups: upgrading to 2.4.8 SUCCEEDED [AUH] cups: upgrading to 2.4.8 SUCCEEDED - - - --- 2024-05-15 auh@yoctoproject.org New
[AUH] zstd: upgrading to 1.5.6 FAILED [AUH] zstd: upgrading to 1.5.6 FAILED - - - --- 2024-05-15 auh@yoctoproject.org New
[AUH] shadow: upgrading to 4.15.1 FAILED [AUH] shadow: upgrading to 4.15.1 FAILED - - - --- 2024-05-15 auh@yoctoproject.org New
[AUH] librsvg: upgrading to 2.58.0 FAILED [AUH] librsvg: upgrading to 2.58.0 FAILED - - - --- 2024-05-15 auh@yoctoproject.org New
[AUH] vulkan-validation-layers: upgrading to 1.3.283.0 FAILED [AUH] vulkan-validation-layers: upgrading to 1.3.283.0 FAILED - - - --- 2024-05-15 auh@yoctoproject.org New
[AUH] strace: upgrading to 6.9 SUCCEEDED [AUH] strace: upgrading to 6.9 SUCCEEDED - - - --- 2024-05-15 auh@yoctoproject.org New
[AUH] ruby: upgrading to 3.3.1 SUCCEEDED [AUH] ruby: upgrading to 3.3.1 SUCCEEDED - - - --- 2024-05-15 auh@yoctoproject.org New
[AUH] libarchive: upgrading to 3.7.4 SUCCEEDED [AUH] libarchive: upgrading to 3.7.4 SUCCEEDED - - - --- 2024-05-15 auh@yoctoproject.org New
[AUH] libxmlb: upgrading to 0.3.19 SUCCEEDED [AUH] libxmlb: upgrading to 0.3.19 SUCCEEDED - - - --- 2024-05-15 auh@yoctoproject.org New
[AUH] libsdl2: upgrading to 2.30.3 SUCCEEDED [AUH] libsdl2: upgrading to 2.30.3 SUCCEEDED - - - --- 2024-05-15 auh@yoctoproject.org New
[AUH] vulkan-utility-libraries: upgrading to 1.3.283.0 SUCCEEDED [AUH] vulkan-utility-libraries: upgrading to 1.3.283.0 SUCCEEDED - - - --- 2024-05-15 auh@yoctoproject.org New
[AUH] libva-initial: upgrading to 2.21.0 FAILED [AUH] libva-initial: upgrading to 2.21.0 FAILED - - - --- 2024-05-15 auh@yoctoproject.org New
[AUH] vulkan-tools: upgrading to 1.3.283.0 FAILED [AUH] vulkan-tools: upgrading to 1.3.283.0 FAILED - - - --- 2024-05-15 auh@yoctoproject.org New
[AUH] mesa: upgrading to 24.0.7 SUCCEEDED [AUH] mesa: upgrading to 24.0.7 SUCCEEDED - - - --- 2024-05-15 auh@yoctoproject.org New
[AUH] stress-ng: upgrading to 0.17.08 SUCCEEDED [AUH] stress-ng: upgrading to 0.17.08 SUCCEEDED - - - --- 2024-05-15 auh@yoctoproject.org New
[AUH] spirv-headers: upgrading to 1.3.283.0 SUCCEEDED [AUH] spirv-headers: upgrading to 1.3.283.0 SUCCEEDED - - - --- 2024-05-15 auh@yoctoproject.org New
[AUH] vulkan-headers: upgrading to 1.3.283.0 SUCCEEDED [AUH] vulkan-headers: upgrading to 1.3.283.0 SUCCEEDED - - - --- 2024-05-15 auh@yoctoproject.org New
[AUH] harfbuzz: upgrading to 8.5.0 SUCCEEDED [AUH] harfbuzz: upgrading to 8.5.0 SUCCEEDED - - - --- 2024-05-15 auh@yoctoproject.org New
[AUH] spirv-tools: upgrading to 1.3.283.0 SUCCEEDED [AUH] spirv-tools: upgrading to 1.3.283.0 SUCCEEDED - - - --- 2024-05-15 auh@yoctoproject.org New
[AUH] gtk-doc: upgrading to 1.34.0 SUCCEEDED [AUH] gtk-doc: upgrading to 1.34.0 SUCCEEDED - - - --- 2024-05-15 auh@yoctoproject.org New
[AUH] ed: upgrading to 1.20.2 SUCCEEDED [AUH] ed: upgrading to 1.20.2 SUCCEEDED - - - --- 2024-05-15 auh@yoctoproject.org New
[AUH] nasm: upgrading to 2.16.03 SUCCEEDED [AUH] nasm: upgrading to 2.16.03 SUCCEEDED - - - --- 2024-05-15 auh@yoctoproject.org New
[AUH] dmidecode: upgrading to 3.6 SUCCEEDED [AUH] dmidecode: upgrading to 3.6 SUCCEEDED - - - --- 2024-05-15 auh@yoctoproject.org New
[AUH] meson: upgrading to 1.4.0 SUCCEEDED [AUH] meson: upgrading to 1.4.0 SUCCEEDED - - - --- 2024-05-15 auh@yoctoproject.org New
[AUH] python3-pygments: upgrading to 2.18.0 SUCCEEDED [AUH] python3-pygments: upgrading to 2.18.0 SUCCEEDED - - - --- 2024-05-15 auh@yoctoproject.org New
[AUH] python3-rpds-py: upgrading to 0.18.1 FAILED [AUH] python3-rpds-py: upgrading to 0.18.1 FAILED - - - --- 2024-05-15 auh@yoctoproject.org New
[AUH] python3-mako: upgrading to 1.3.5 SUCCEEDED [AUH] python3-mako: upgrading to 1.3.5 SUCCEEDED - - - --- 2024-05-15 auh@yoctoproject.org New
[AUH] python3-lxml: upgrading to 5.2.2 SUCCEEDED [AUH] python3-lxml: upgrading to 5.2.2 SUCCEEDED - - - --- 2024-05-15 auh@yoctoproject.org New
[AUH] python3-referencing: upgrading to 0.35.1 SUCCEEDED [AUH] python3-referencing: upgrading to 0.35.1 SUCCEEDED - - - --- 2024-05-15 auh@yoctoproject.org New
[AUH] dnf: upgrading to 4.20.0 SUCCEEDED [AUH] dnf: upgrading to 4.20.0 SUCCEEDED - - - --- 2024-05-15 auh@yoctoproject.org New
[AUH] python3-cryptography: upgrading to 42.0.7 FAILED [AUH] python3-cryptography: upgrading to 42.0.7 FAILED - - - --- 2024-05-15 auh@yoctoproject.org New
[AUH] python3-docutils: upgrading to 0.21.2 FAILED [AUH] python3-docutils: upgrading to 0.21.2 FAILED - - - --- 2024-05-15 auh@yoctoproject.org New
[AUH] ifupdown: upgrading to 0.8.43 FAILED [AUH] ifupdown: upgrading to 0.8.43 FAILED - - - --- 2024-05-15 auh@yoctoproject.org New
[AUH] python3-jsonschema: upgrading to 4.22.0 SUCCEEDED [AUH] python3-jsonschema: upgrading to 4.22.0 SUCCEEDED - - - --- 2024-05-15 auh@yoctoproject.org New
[AUH] createrepo-c: upgrading to 1.1.1 SUCCEEDED [AUH] createrepo-c: upgrading to 1.1.1 SUCCEEDED - - - --- 2024-05-15 auh@yoctoproject.org New
[AUH] go-runtime: upgrading to 1.22.3 FAILED [AUH] go-runtime: upgrading to 1.22.3 FAILED - - - --- 2024-05-15 auh@yoctoproject.org New
[AUH] librepo: upgrading to 1.17.1 SUCCEEDED [AUH] librepo: upgrading to 1.17.1 SUCCEEDED - - - --- 2024-05-15 auh@yoctoproject.org New
[AUH] python3-hatchling: upgrading to 1.24.2 SUCCEEDED [AUH] python3-hatchling: upgrading to 1.24.2 SUCCEEDED - - - --- 2024-05-15 auh@yoctoproject.org Under Review
[AUH] go: upgrading to 1.22.3 FAILED [AUH] go: upgrading to 1.22.3 FAILED - - - --- 2024-05-15 auh@yoctoproject.org New
[AUH] cmake: upgrading to 3.29.3 FAILED [AUH] cmake: upgrading to 3.29.3 FAILED - - - --- 2024-05-15 auh@yoctoproject.org New
[AUH] python3-hypothesis: upgrading to 6.102.4 SUCCEEDED [AUH] python3-hypothesis: upgrading to 6.102.4 SUCCEEDED - - - --- 2024-05-15 auh@yoctoproject.org New
[AUH] ninja: upgrading to 1.12.1 SUCCEEDED [AUH] ninja: upgrading to 1.12.1 SUCCEEDED - - - --- 2024-05-15 auh@yoctoproject.org New
[AUH] btrfs-tools: upgrading to 6.8.1 SUCCEEDED [AUH] btrfs-tools: upgrading to 6.8.1 SUCCEEDED - - - --- 2024-05-15 auh@yoctoproject.org New
[AUH] mobile-broadband-provider-info: upgrading to 20240407 FAILED [AUH] mobile-broadband-provider-info: upgrading to 20240407 FAILED - - - --- 2024-05-15 auh@yoctoproject.org New
[AUH] libxml2: upgrading to 2.12.7 SUCCEEDED [AUH] libxml2: upgrading to 2.12.7 SUCCEEDED - - - --- 2024-05-15 auh@yoctoproject.org New
[AUH] glib-networking: upgrading to 2.80.0 SUCCEEDED [AUH] glib-networking: upgrading to 2.80.0 SUCCEEDED - - - --- 2024-05-15 auh@yoctoproject.org New
[AUH] systemd-boot: upgrading to 255.6 SUCCEEDED [AUH] systemd-boot: upgrading to 255.6 SUCCEEDED - - - --- 2024-05-15 auh@yoctoproject.org New
[AUH] iproute2: upgrading to 6.9.0 SUCCEEDED [AUH] iproute2: upgrading to 6.9.0 SUCCEEDED - - - --- 2024-05-15 auh@yoctoproject.org New
[AUH] ofono: upgrading to 2.7 FAILED [AUH] ofono: upgrading to 2.7 FAILED - - - --- 2024-05-15 auh@yoctoproject.org New
[AUH] dropbear: upgrading to 2024.85 SUCCEEDED [AUH] dropbear: upgrading to 2024.85 SUCCEEDED - - - --- 2024-05-15 auh@yoctoproject.org New
[AUH] libslirp: upgrading to 4.8.0 SUCCEEDED [AUH] libslirp: upgrading to 4.8.0 SUCCEEDED - - - --- 2024-05-15 auh@yoctoproject.org New
[AUH] bluez5: upgrading to 5.75 FAILED [AUH] bluez5: upgrading to 5.75 FAILED - - - --- 2024-05-15 auh@yoctoproject.org New
[AUH] glib-2.0: upgrading to 2.80.2 FAILED [AUH] glib-2.0: upgrading to 2.80.2 FAILED - - - --- 2024-05-15 auh@yoctoproject.org New
[AUH] ell: upgrading to 0.65 SUCCEEDED [AUH] ell: upgrading to 0.65 SUCCEEDED - - - --- 2024-05-15 auh@yoctoproject.org New
[AUH] systemd: upgrading to 255.6 FAILED [AUH] systemd: upgrading to 255.6 FAILED - - - --- 2024-05-15 auh@yoctoproject.org New
lib/oe/reproducible: Update for WORKDIR -> UNPACKDIR lib/oe/reproducible: Update for WORKDIR -> UNPACKDIR - - - --- 2024-05-15 Richard Purdie New
[v3] ipk/rootfs: run sanity test of multilib in parallel [v3] ipk/rootfs: run sanity test of multilib in parallel - - - --- 2024-05-15 seungkyun.kim@lge.com New
[v2] ipk/rootfs: run sanity test of multilib in parallel [v2] ipk/rootfs: run sanity test of multilib in parallel - - - --- 2024-05-15 seungkyun.kim@lge.com New
[07/10] insane: Warn about S == WORKDIR [01/10] recipes: Start WORKDIR -> UNPACKDIR transition - - - --- 2024-05-15 Richard Purdie New
[06/10] recipetool/devtool: Update to work correctly with UNPACKDIR [01/10] recipes: Start WORKDIR -> UNPACKDIR transition - - - --- 2024-05-15 Richard Purdie New
[05/10] base: Switch UNPACKDIR to a subdir of WORKDIR [01/10] recipes: Start WORKDIR -> UNPACKDIR transition - - - --- 2024-05-15 Richard Purdie New
[master,scarthgap,kirkstone] systemd-systemctl: Add extra log for easy of debugging [master,scarthgap,kirkstone] systemd-systemctl: Add extra log for easy of debugging - - - --- 2024-05-15 Ranjitsinh Rathod sakoman Awaiting Upstream
[kirkstone] systemd-systemctl: Fix WantedBy processing [kirkstone] systemd-systemctl: Fix WantedBy processing - - - --- 2024-05-15 Ranjitsinh Rathod sakoman Under Review
[kirkstone,1/1] bluez5: Fix CVE-2023-50230, CVE-2023-50229 and CVE-2023-27349 [kirkstone,1/1] bluez5: Fix CVE-2023-50230, CVE-2023-50229 and CVE-2023-27349 - - - --- 2024-05-15 ssambu sakoman Changes Requested
gstreamer1.0-plugins-bad: rename onevpl-intel-gpu -> vpl-gpu-rt gstreamer1.0-plugins-bad: rename onevpl-intel-gpu -> vpl-gpu-rt - - - --- 2024-05-15 Naveen Saini New
[kirkstone,1/1] libarchive: fix CVE-2024-26256 [kirkstone,1/1] libarchive: fix CVE-2024-26256 - - - --- 2024-05-15 yurade sakoman Under Review
[kirkstone] classes: go-mod: do not pack go mod cache [kirkstone] classes: go-mod: do not pack go mod cache - - - --- 2024-05-14 Jose Quaresma sakoman Under Review
[kirkstone,2/2] go.bbclass: fix path to linker in native Go builds [kirkstone,1/2] go: Always pass interpreter to linker - - - --- 2024-05-14 Jose Quaresma sakoman Under Review
[kirkstone,1/2] go: Always pass interpreter to linker [kirkstone,1/2] go: Always pass interpreter to linker - - - --- 2024-05-14 Jose Quaresma sakoman Under Review
ipk/rootfs: run sanity test of multilib in parallel ipk/rootfs: run sanity test of multilib in parallel - - - --- 2024-05-13 seungkyun.kim@lge.com New
[master,scarthgap] ptest-runner: Bump to 2.4.4 (95f528c) [master,scarthgap] ptest-runner: Bump to 2.4.4 (95f528c) - - - --- 2024-05-13 Changqing Li sakoman Awaiting Upstream
[kirkstone] ipk/rootfs: run sanity test of multilib in parallel [kirkstone] ipk/rootfs: run sanity test of multilib in parallel - - - --- 2024-05-13 seungkyun.kim@lge.com sakoman Awaiting Upstream
[v8,3/3] classes: add a systemd-sysext image class pkg-database and systemd-sysext image - - - --- 2024-05-12 Johannes Schneider New
[v8,2/3] image.bbclass/rootfs: set and unpack package-database pkg-database and systemd-sysext image - - - --- 2024-05-12 Johannes Schneider New
[v8,1/3] image.bbclass/rootfs: archive and deploy package database pkg-database and systemd-sysext image - - - --- 2024-05-12 Johannes Schneider New
[kirkstone] systemd: Add patches to fix systemd-udev delay during initialization [kirkstone] systemd: Add patches to fix systemd-udev delay during initialization - - - --- 2024-05-11 Ranjitsinh Rathod sakoman Rejected
[v7,3/3] classes: add a systemd-sysext image class pkg-database and systemd-sysext image - - - --- 2024-05-10 Johannes Schneider New
[v7,2/3] image.bbclass/rootfs: set and unpack package-database pkg-database and systemd-sysext image - - - --- 2024-05-10 Johannes Schneider New
[v7,1/3] image.bbclass/rootfs: archive and deploy package database pkg-database and systemd-sysext image - - - --- 2024-05-10 Johannes Schneider New
[scarthgap] glib-2.0: Upgrade 2.78.5 -> 2.78.6 [scarthgap] glib-2.0: Upgrade 2.78.5 -> 2.78.6 - - - --- 2024-05-09 Marko, Peter sakoman Under Review
bitbake-config-build: add a plugin for config fragments bitbake-config-build: add a plugin for config fragments - - - --- 2024-05-09 Alexander Kanavin New
[scarthgap] uboot-sign: fix loop in do_uboot_assemble_fitimage [scarthgap] uboot-sign: fix loop in do_uboot_assemble_fitimage - - - --- 2024-05-09 Ralph Siemsen sakoman Under Review
enchant2: Disable incompatible-pointer-types warning as error enchant2: Disable incompatible-pointer-types warning as error - - - --- 2024-05-09 Khem Raj New
[master,scarthgap,1/1] xserver-xorg: upgrade 21.1.11 -> 21.1.12 [master,scarthgap,1/1] xserver-xorg: upgrade 21.1.11 -> 21.1.12 - - - --- 2024-05-08 Polampalli, Archana sakoman Under Review
[scarthgap] glib-2.0: Upgrade 2.78.4 -> 2.78.5 [scarthgap] glib-2.0: Upgrade 2.78.4 -> 2.78.5 - - - --- 2024-05-08 Marko, Peter sakoman Under Review
[PATCHv1] Fix building error with '-O2' in sysroot path [PATCHv1] Fix building error with '-O2' in sysroot path - - - --- 2024-05-08 simit.ghane New
[9/9] scripts/oe-replicate-build: add a script that packages and replicates a yocto build elsewhere [1/9] bblayers/makesetup: raise exceptions when errors happen - - - --- 2024-05-07 Alexander Kanavin New
[8/9] selftest/sstatetests: move exception list for cache objects to the parent class [1/9] bblayers/makesetup: raise exceptions when errors happen - - - --- 2024-05-07 Alexander Kanavin New
[7/9] selftest/sstatetests: separate sstate presence check into its own class [1/9] bblayers/makesetup: raise exceptions when errors happen - - - --- 2024-05-07 Alexander Kanavin New
[6/9] sstatesig/dump_sigs: allow setting output directory explicitly from command line option [1/9] bblayers/makesetup: raise exceptions when errors happen - - - --- 2024-05-07 Alexander Kanavin New
[5/9] lib/oe/sstatesig.py: add an option to make a unihash cache copy [1/9] bblayers/makesetup: raise exceptions when errors happen - - - --- 2024-05-07 Alexander Kanavin New
[4/9] bblayers/setupwriters/oe-local-copy: add a 'local copy' plugin for bitbake-layers create-laye… [1/9] bblayers/makesetup: raise exceptions when errors happen - - - --- 2024-05-07 Alexander Kanavin New
[3/9] bblayers/makesetup: move check for existence of git remotes to oe-setup-layers plugin [1/9] bblayers/makesetup: raise exceptions when errors happen - - - --- 2024-05-07 Alexander Kanavin New
[2/9] bblayers/makesetup: include local repository paths in discovered layer repo data [1/9] bblayers/makesetup: raise exceptions when errors happen - - - --- 2024-05-07 Alexander Kanavin New
[1/9] bblayers/makesetup: raise exceptions when errors happen [1/9] bblayers/makesetup: raise exceptions when errors happen - - - --- 2024-05-07 Alexander Kanavin New
[v2,04/11] zip lrzsz connman-gnome libfm: ignore various issues fatal with gcc-14 [v2,01/11] rng-tools: ignore incompatible-pointer-types errors for now - - - --- 2024-05-07 Khem Raj New
python3: Treat UID/GID overflow at failure python3: Treat UID/GID overflow at failure - - - --- 2024-05-07 Khem Raj New
« 1 2 3 477 78 »