Show patches with: State = Action Required       |    Archived = No       |   15462 patches
« 1 2 3 4 … 154 155 »
Patch Series A/R/T S/W/F Date Submitter Delegate State
[v2,3/3] oe/package.py: copydebugsources: add all kernel source files Fix kernel complementary package installation - - - --- 2026-09-23 AdrianF Under Review
[v2,2/3] core-image.bbclass: do not pull the kernel -src package in via complementary packages Fix kernel complementary package installation - - - --- 2026-09-23 AdrianF Under Review
[v2,1/3] kernel.bbclass: make the -src package installable on purpose Fix kernel complementary package installation - - - --- 2026-09-23 AdrianF Under Review
[13/13] selftest: resulttooltests.py: add min-duration default test resulttool: add 'durations' subcommand and selftests - - - --- 2026-09-23 Trevor Gamblin Under Review
[12/13] selftest: resulttooltests.py: add short-tables ordering test resulttool: add 'durations' subcommand and selftests - - - --- 2026-09-23 Trevor Gamblin Under Review
[11/13] selftest: resulttooltests.py: add limit-after-sort test resulttool: add 'durations' subcommand and selftests - - - --- 2026-09-23 Trevor Gamblin Under Review
[10/13] selftest: resulttooltests.py: add sort-by-delta test resulttool: add 'durations' subcommand and selftests - - - --- 2026-09-23 Trevor Gamblin Under Review
[09/13] selftest: resulttooltests.py: add None-pct threshold test resulttool: add 'durations' subcommand and selftests - - - --- 2026-09-23 Trevor Gamblin Under Review
[08/13] selftest: resulttooltests.py: add multi-pair threshold test resulttool: add 'durations' subcommand and selftests - - - --- 2026-09-23 Trevor Gamblin Under Review
[07/13] selftest: resulttooltests.py: add threshold-disabled test resulttool: add 'durations' subcommand and selftests - - - --- 2026-09-23 Trevor Gamblin Under Review
[06/13] selftest: resulttooltests.py: add threshold filtering test resulttool: add 'durations' subcommand and selftests - - - --- 2026-09-23 Trevor Gamblin Under Review
[05/13] selftest: resulttooltests.py: add consecutive-pair delta test resulttool: add 'durations' subcommand and selftests - - - --- 2026-09-23 Trevor Gamblin Under Review
[04/13] selftest: resulttooltests.py: add zero-round pct suppression test resulttool: add 'durations' subcommand and selftests - - - --- 2026-09-23 Trevor Gamblin Under Review
[03/13] selftest: resulttooltests.py: add report-log Time(s) column test resulttool: add 'durations' subcommand and selftests - - - --- 2026-09-23 Trevor Gamblin Under Review
[02/13] selftest: resulttooltests.py: add basic durations test resulttool: add 'durations' subcommand and selftests - - - --- 2026-09-23 Trevor Gamblin Under Review
[01/13] scripts: resulttool: add 'durations' option resulttool: add 'durations' subcommand and selftests - - - --- 2026-09-23 Trevor Gamblin Under Review
[scarthgap] u-boot-tools: use all patches from u-boot [scarthgap] u-boot-tools: use all patches from u-boot - - - --- 2026-09-23 Marko, Peter ycongal_smile New
coreutils: Upgrade 9.11 -> 9.12 coreutils: Upgrade 9.11 -> 9.12 - - - --- 2026-09-23 Leon Anavi Under Review
[scarthgap] systemd: backport networkd route readiness fix from upstream [scarthgap] systemd: backport networkd route readiness fix from upstream - - - --- 2026-09-23 Akash Hadke ycongal_smile Under Review
[scarthgap,v2] python3-click: fix CVE-2026-7246 [scarthgap,v2] python3-click: fix CVE-2026-7246 - - - --- 2026-09-23 Darsh Kelaiya -X (dkelaiya - E INFOCHIPS PRIVATE LIMITED at Cisco) ycongal_smile Under Review
[AUH] gpgme: upgrading to 2.2.0 SUCCEEDED [AUH] gpgme: upgrading to 2.2.0 SUCCEEDED - - - --- 2026-09-23 auh@yoctoproject.org New
[AUH] python3-mako: upgrading to 1.4.3 SUCCEEDED [AUH] python3-mako: upgrading to 1.4.3 SUCCEEDED - - - --- 2026-09-23 auh@yoctoproject.org New
[AUH] gnupg: upgrading to 2.5.23 SUCCEEDED [AUH] gnupg: upgrading to 2.5.23 SUCCEEDED - - - --- 2026-09-23 auh@yoctoproject.org New
[AUH] python3-uv-build: upgrading to 0.12.18 SUCCEEDED [AUH] python3-uv-build: upgrading to 0.12.18 SUCCEEDED - - - --- 2026-09-23 auh@yoctoproject.org New
[AUH] python3-pdm-backend: upgrading to 2.4.10 SUCCEEDED [AUH] python3-pdm-backend: upgrading to 2.4.10 SUCCEEDED - - - --- 2026-09-23 auh@yoctoproject.org New
[AUH] python3-hypothesis: upgrading to 6.168.1 SUCCEEDED [AUH] python3-hypothesis: upgrading to 6.168.1 SUCCEEDED - - - --- 2026-09-23 auh@yoctoproject.org New
[AUH] python3-cython: upgrading to 3.3.0 SUCCEEDED [AUH] python3-cython: upgrading to 3.3.0 SUCCEEDED - - - --- 2026-09-23 auh@yoctoproject.org New
[AUH] meson: upgrading to 1.12.1 SUCCEEDED [AUH] meson: upgrading to 1.12.1 SUCCEEDED - - - --- 2026-09-23 auh@yoctoproject.org New
[AUH] libslirp: upgrading to 4.9.5 SUCCEEDED [AUH] libslirp: upgrading to 4.9.5 SUCCEEDED - - - --- 2026-09-23 auh@yoctoproject.org New
[AUH] expat: upgrading to 2.8.5 SUCCEEDED [AUH] expat: upgrading to 2.8.5 SUCCEEDED - - - --- 2026-09-23 auh@yoctoproject.org New
[scarthgap] vim: fix backport format for CVE-2026-73076 [scarthgap] vim: fix backport format for CVE-2026-73076 - - - --- 2026-09-23 Hitendra Prajapati ycongal_smile Under Review
[wrynose] cpio: fix "CVE:" marker in CVE-2026-66484.patch [wrynose] cpio: fix "CVE:" marker in CVE-2026-66484.patch - - - --- 2026-09-22 Yoann Congal ycongal_smile Under Review
[5/5] go-mod-update-modules: include the generated files from the class [1/5] gcr: initialize libgcrypt from the secret exchange - - - --- 2026-09-22 Markus Volk Under Review
[4/5] license_finder: normalise license texts before hashing [1/5] gcr: initialize libgcrypt from the secret exchange - - - --- 2026-09-22 Markus Volk Under Review
[3/5] spdx_license: give UnknownId a name [1/5] gcr: initialize libgcrypt from the secret exchange - - - --- 2026-09-22 Markus Volk Under Review
[1/5] gcr: initialize libgcrypt from the secret exchange [1/5] gcr: initialize libgcrypt from the secret exchange - - - --- 2026-09-22 Markus Volk Under Review
[wrynose,4/5] ffmpeg: Fix for CVE-2026-66039 [wrynose,1/5] ffmpeg: Fix for CVE-2026-66036 - - - --- 2026-09-22 Bhavesh Rajesh Maheshwari ycongal_smile Under Review
[wrynose,3/5] ffmpeg: Fix for CVE-2026-66038 [wrynose,1/5] ffmpeg: Fix for CVE-2026-66036 - - - --- 2026-09-22 Bhavesh Rajesh Maheshwari ycongal_smile Under Review
[wrynose,2/5] ffmpeg: Fix for CVE-2026-66037 [wrynose,1/5] ffmpeg: Fix for CVE-2026-66036 - - - --- 2026-09-22 Bhavesh Rajesh Maheshwari ycongal_smile Under Review
[wrynose] bitbake.conf: pseudo add rootfs-dbg to PSEUDO_INCLUDE_PATHS [wrynose] bitbake.conf: pseudo add rootfs-dbg to PSEUDO_INCLUDE_PATHS - - - --- 2026-09-22 Marko, Peter ycongal_smile Under Review
[wrynose] qemu: fix CVE-2026-48914 [wrynose] qemu: fix CVE-2026-48914 - - - --- 2026-09-22 Roopa Kalmath ycongal_smile Under Review
[AUH] repo: upgrading to 2.68 SUCCEEDED [AUH] repo: upgrading to 2.68 SUCCEEDED - - - --- 2026-09-22 auh@yoctoproject.org New
[AUH] libsolv: upgrading to 0.7.40 SUCCEEDED [AUH] libsolv: upgrading to 0.7.40 SUCCEEDED - - - --- 2026-09-22 auh@yoctoproject.org New
[AUH] diffoscope: upgrading to 330 SUCCEEDED [AUH] diffoscope: upgrading to 330 SUCCEEDED - - - --- 2026-09-22 auh@yoctoproject.org New
[AUH] python3-trove-classifiers: upgrading to 2026.9.21.13 SUCCEEDED [AUH] python3-trove-classifiers: upgrading to 2026.9.21.13 SUCCEEDED - - - --- 2026-09-22 auh@yoctoproject.org New
[AUH] ttyrun: upgrading to 2.44.1 SUCCEEDED [AUH] ttyrun: upgrading to 2.44.1 SUCCEEDED - - - --- 2026-09-22 auh@yoctoproject.org New
[scarthgap,v2,7/7] libpcap: Fix CVE-2026-18238 libpcap: backport seven CVE fixes from 1.10.7 - - - --- 2026-09-21 Jaipaul Cheernam ycongal_smile Under Review
[scarthgap,v2,6/7] libpcap: Fix CVE-2026-18313 libpcap: backport seven CVE fixes from 1.10.7 - - - --- 2026-09-21 Jaipaul Cheernam ycongal_smile Under Review
[scarthgap,v2,5/7] libpcap: Fix CVE-2026-6554 libpcap: backport seven CVE fixes from 1.10.7 - - - --- 2026-09-21 Jaipaul Cheernam ycongal_smile Under Review
[scarthgap,v2,4/7] libpcap: Fix CVE-2026-6244 libpcap: backport seven CVE fixes from 1.10.7 - - - --- 2026-09-21 Jaipaul Cheernam ycongal_smile Under Review
[scarthgap,v2,3/7] libpcap: Fix CVE-2026-31911 libpcap: backport seven CVE fixes from 1.10.7 - - - --- 2026-09-21 Jaipaul Cheernam ycongal_smile Under Review
[scarthgap,v2,2/7] libpcap: Fix CVE-2026-31912 libpcap: backport seven CVE fixes from 1.10.7 - - - --- 2026-09-21 Jaipaul Cheernam ycongal_smile Under Review
[scarthgap,v2,1/7] libpcap: Fix CVE-2026-0799 libpcap: backport seven CVE fixes from 1.10.7 - - - --- 2026-09-21 Jaipaul Cheernam ycongal_smile Under Review
[v3] psmisc: add ptest support [v3] psmisc: add ptest support - - - --- 2026-09-21 Pratik Farkase Under Review
[master,PATCHv2] alsa-lib: Add ptest [master,PATCHv2] alsa-lib: Add ptest - - - --- 2026-09-21 Sana Kazi Under Review
[AUH] utfcpp: upgrading to 4.2.1 SUCCEEDED [AUH] utfcpp: upgrading to 4.2.1 SUCCEEDED - - - --- 2026-09-21 auh@yoctoproject.org New
[AUH] fribidi: upgrading to 1.0.17 SUCCEEDED [AUH] fribidi: upgrading to 1.0.17 SUCCEEDED - - - --- 2026-09-21 auh@yoctoproject.org New
[AUH] gzip: upgrading to 1.15 SUCCEEDED [AUH] gzip: upgrading to 1.15 SUCCEEDED - - - --- 2026-09-21 auh@yoctoproject.org New
[AUH] rsync: upgrading to 3.5.1 FAILED [AUH] rsync: upgrading to 3.5.1 FAILED - - - --- 2026-09-21 auh@yoctoproject.org New
[AUH] harfbuzz: upgrading to 14.5.0 SUCCEEDED [AUH] harfbuzz: upgrading to 14.5.0 SUCCEEDED - - - --- 2026-09-21 auh@yoctoproject.org New
[AUH] cairo: upgrading to 1.18.6 SUCCEEDED [AUH] cairo: upgrading to 1.18.6 SUCCEEDED - - - --- 2026-09-21 auh@yoctoproject.org New
[AUH] stress-ng: upgrading to 0.22.01 SUCCEEDED [AUH] stress-ng: upgrading to 0.22.01 SUCCEEDED - - - --- 2026-09-21 auh@yoctoproject.org New
[AUH] python3-hatchling: upgrading to 1.32.4 SUCCEEDED [AUH] python3-hatchling: upgrading to 1.32.4 SUCCEEDED - - - --- 2026-09-21 auh@yoctoproject.org New
[AUH] python3-pyparsing: upgrading to 3.3.3 SUCCEEDED [AUH] python3-pyparsing: upgrading to 3.3.3 SUCCEEDED - - - --- 2026-09-21 auh@yoctoproject.org New
[wrynose,5/5] python3-sbom-cve-check: update to version 1.3.5 [wrynose,1/5] sbom-cve-check-update-nvd-native,sbom-cve-check-update-cvelist-native: upgrade 2026.0… - - - --- 2026-09-20 Marko, Peter ycongal_smile Under Review
[wrynose,4/5] sbom-cve-check-update-{nvd-native,cvelist-native}: upgrade 2026.08.25 -> 2026.09.12 [wrynose,1/5] sbom-cve-check-update-nvd-native,sbom-cve-check-update-cvelist-native: upgrade 2026.0… - - - --- 2026-09-20 Marko, Peter ycongal_smile Under Review
[wrynose,3/5] python3-sbom-cve-check: update to version 1.3.4 [wrynose,1/5] sbom-cve-check-update-nvd-native,sbom-cve-check-update-cvelist-native: upgrade 2026.0… - - - --- 2026-09-20 Marko, Peter ycongal_smile Under Review
[wrynose,2/5] sbom-cve-check-update-db: Exclude recipes from rm_work [wrynose,1/5] sbom-cve-check-update-nvd-native,sbom-cve-check-update-cvelist-native: upgrade 2026.0… - - - --- 2026-09-20 Marko, Peter ycongal_smile Under Review
[wrynose,1/5] sbom-cve-check-update-nvd-native,sbom-cve-check-update-cvelist-native: upgrade 2026.0… [wrynose,1/5] sbom-cve-check-update-nvd-native,sbom-cve-check-update-cvelist-native: upgrade 2026.0… - - - --- 2026-09-20 Marko, Peter ycongal_smile Under Review
[AUH] puzzles: upgrading to ea09098d71db949351437eba1920033d3a08f491 SUCCEEDED [AUH] puzzles: upgrading to ea09098d71db949351437eba1920033d3a08f491 SUCCEEDED - - - --- 2026-09-20 auh@yoctoproject.org New
[AUH] python3-poetry-core: upgrading to 2.5.0 SUCCEEDED [AUH] python3-poetry-core: upgrading to 2.5.0 SUCCEEDED - - - --- 2026-09-20 auh@yoctoproject.org New
[scarthgap] at-spi2-core: RDEPENDS on gsettings-desktop-schemas [scarthgap] at-spi2-core: RDEPENDS on gsettings-desktop-schemas - - - --- 2026-09-19 Tim Orling ycongal_smile Under Review
oeqa/selftest: add fs-uuid.bbclass coverage oeqa/selftest: add fs-uuid.bbclass coverage - - - --- 2026-09-19 Angel2Eyes Under Review
[wrynose] at-spi2-core: RDEPENDS on gsettings-desktop-schemas [wrynose] at-spi2-core: RDEPENDS on gsettings-desktop-schemas - - - --- 2026-09-19 Tim Orling ycongal_smile Under Review
[wrynose] toolchain-scripts: fix kernel host tool builds broken in the SDK [wrynose] toolchain-scripts: fix kernel host tool builds broken in the SDK - - - --- 2026-09-19 Daniel Dragomir ycongal_smile Under Review
[AUH] xxhash: upgrading to 0.8.4 SUCCEEDED [AUH] xxhash: upgrading to 0.8.4 SUCCEEDED - - - --- 2026-09-19 auh@yoctoproject.org New
[AUH] ffmpeg: upgrading to 9.0.2 SUCCEEDED [AUH] ffmpeg: upgrading to 9.0.2 SUCCEEDED - - - --- 2026-09-19 auh@yoctoproject.org New
[AUH] python3-uv-build: upgrading to 0.12.17 SUCCEEDED [AUH] python3-uv-build: upgrading to 0.12.17 SUCCEEDED - - - --- 2026-09-19 auh@yoctoproject.org New
[AUH] librsvg: upgrading to 2.63.2 SUCCEEDED [AUH] librsvg: upgrading to 2.63.2 SUCCEEDED - - - --- 2026-09-19 auh@yoctoproject.org New
[AUH] python3-dtschema: upgrading to 2026.9 SUCCEEDED [AUH] python3-dtschema: upgrading to 2026.9 SUCCEEDED - - - --- 2026-09-19 auh@yoctoproject.org New
xorgproto: Set ALLOW_EMPTY for the main package xorgproto: Set ALLOW_EMPTY for the main package - - - --- 2026-09-18 Jonas Mark (BT-EL/ESW1) Under Review
[wrynose,v2] vim: Fix CVE-2026-28417 hostname regression [wrynose,v2] vim: Fix CVE-2026-28417 hostname regression - - - --- 2026-09-18 Devansh Patel -X (devanshp - E INFOCHIPS PRIVATE LIMITED at Cisco) ycongal_smile Under Review
[v2,RESEND] classes/archiver: fix tarball content in "original" mode [v2,RESEND] classes/archiver: fix tarball content in "original" mode - - - --- 2026-09-18 João Marcos Costa Under Review
[AUH] less: upgrading to 710 SUCCEEDED [AUH] less: upgrading to 710 SUCCEEDED - - - --- 2026-09-18 auh@yoctoproject.org New
[AUH] python3-wcwidth: upgrading to 0.8.4 SUCCEEDED [AUH] python3-wcwidth: upgrading to 0.8.4 SUCCEEDED - - - --- 2026-09-18 auh@yoctoproject.org New
[AUH] python3-hatchling: upgrading to 1.32.3 SUCCEEDED [AUH] python3-hatchling: upgrading to 1.32.3 SUCCEEDED - - - --- 2026-09-18 auh@yoctoproject.org New
[AUH] python3-uv-build: upgrading to 0.12.16 SUCCEEDED [AUH] python3-uv-build: upgrading to 0.12.16 SUCCEEDED - - - --- 2026-09-18 auh@yoctoproject.org New
[AUH] python3-idna: upgrading to 3.20 SUCCEEDED [AUH] python3-idna: upgrading to 3.20 SUCCEEDED - - - --- 2026-09-18 auh@yoctoproject.org New
[AUH] python3-pdm: upgrading to 2.29.2 SUCCEEDED [AUH] python3-pdm: upgrading to 2.29.2 SUCCEEDED - - - --- 2026-09-18 auh@yoctoproject.org New
[AUH] tzcode-native,tzdata: upgrading to 2026d,2026d FAILED [AUH] tzcode-native,tzdata: upgrading to 2026d,2026d FAILED - - - --- 2026-09-18 auh@yoctoproject.org New
[wrynose] fmt: update branch name to main [wrynose] fmt: update branch name to main - - - --- 2026-09-17 Marko, Peter ycongal_smile Under Review
[AUH] linux-firmware: upgrading to 20260916 FAILED [AUH] linux-firmware: upgrading to 20260916 FAILED - - - --- 2026-09-17 auh@yoctoproject.org New
[AUH] tcf-agent: upgrading to 1.11.1 FAILED [AUH] tcf-agent: upgrading to 1.11.1 FAILED - - - --- 2026-09-17 auh@yoctoproject.org New
[AUH] python3-vcs-versioning: upgrading to 2.4.1 SUCCEEDED [AUH] python3-vcs-versioning: upgrading to 2.4.1 SUCCEEDED - - - --- 2026-09-17 auh@yoctoproject.org New
[AUH] python3-pyproject-hooks: upgrading to 1.3.3 SUCCEEDED [AUH] python3-pyproject-hooks: upgrading to 1.3.3 SUCCEEDED - - - --- 2026-09-17 auh@yoctoproject.org New
[AUH] python3-flit-core: upgrading to 4.1.0 SUCCEEDED [AUH] python3-flit-core: upgrading to 4.1.0 SUCCEEDED - - - --- 2026-09-17 auh@yoctoproject.org New
[AUH] python3-pdm-build-locked: upgrading to 0.3.8 SUCCEEDED [AUH] python3-pdm-build-locked: upgrading to 0.3.8 SUCCEEDED - - - --- 2026-09-17 auh@yoctoproject.org New
[AUH] python3-hatchling: upgrading to 1.32.1 FAILED [AUH] python3-hatchling: upgrading to 1.32.1 FAILED - - - --- 2026-09-17 auh@yoctoproject.org New
[AUH] barebox-tools: upgrading to 2026.09.0 SUCCEEDED [AUH] barebox-tools: upgrading to 2026.09.0 SUCCEEDED - - - --- 2026-09-17 auh@yoctoproject.org New
[AUH] bind: upgrading to 9.20.29 SUCCEEDED [AUH] bind: upgrading to 9.20.29 SUCCEEDED - - - --- 2026-09-17 auh@yoctoproject.org New
« 1 2 3 4 … 154 155 »