Toggle navigation
Patchwork
OpenEmbedded Core Layer
Patches
Bundles
About this project
Login
Register
Mail settings
Show patches with
: Archived =
No
| 12490 patches
Series
Submitter
State
any
Action Required
New
Under Review
Accepted
Rejected
RFC
Not Applicable
Changes Requested
Awaiting Upstream
Superseded
Deferred
Search
Archived
No
Yes
Both
Delegate
------
Nobody
gitpwbot
gitpwbot
gitpwbot
gitpwbot
gitpwbot
gitpwbot
gitpwbot
gitpwbot
akuster
akuster
akuster
akuster
mototimo
mototimo
mototimo
kraj
kraj
denix
denix
reatmon
reatmon
rpurdie
rpurdie
rpurdie
rpurdie
sakoman
rossburton
rossburton
jonmason
abelloni
abelloni
agodard
Apply
«
1
2
...
25
26
27
…
124
125
»
Patch
Series
A/R/T
S/W/F
Date
Submitter
Delegate
State
[master] run-ptest: removed 'sed -u' option
[master] run-ptest: removed 'sed -u' option
- - -
-
-
-
2024-10-21
Pawan Badganchi
New
[kirkstone] libyaml: Add libyaml ptest
[kirkstone] libyaml: Add libyaml ptest
- - -
-
-
-
2024-10-21
Virendra Thakur
sakoman
Changes Requested
[1/1] matchbox-panel-2: add sysfs support
[1/1] matchbox-panel-2: add sysfs support
- - -
-
-
-
2024-10-20
Dixit Parmar
New
linux-firmware: upgrade 20240909 -> 20241017
linux-firmware: upgrade 20240909 -> 20241017
- - -
-
-
-
2024-10-20
Vivek Puar
New
[2/2] python3-libarchive-c: Avoid using find_library python API
[1/2] python3-packaging: Ignore old glibc tests on musl
- - -
-
-
-
2024-10-19
Khem Raj
New
[1/2] python3-packaging: Ignore old glibc tests on musl
[1/2] python3-packaging: Ignore old glibc tests on musl
- - -
-
-
-
2024-10-19
Khem Raj
New
[scarthgap] alsa-lib: enabling ptest for alsa-lib component
[scarthgap] alsa-lib: enabling ptest for alsa-lib component
- - -
-
-
-
2024-10-19
aszh07
sakoman
Changes Requested
python3: Fix platform triplet detection
python3: Fix platform triplet detection
- - -
-
-
-
2024-10-19
Khem Raj
New
classes: rootfs-postcommands: set better sane time to systemd
classes: rootfs-postcommands: set better sane time to systemd
- - -
-
-
-
2024-10-19
Gaël PORTAY
New
[4/4] lib: package: Copy locale license
Incompatible license handling fixes
- - -
-
-
-
2024-10-18
Joshua Watt
New
[3/4] lib: package: Check for incompatible licenses in locale packages
Incompatible license handling fixes
- - -
-
-
-
2024-10-18
Joshua Watt
New
[2/4] lib: license: Move package license skip to library
Incompatible license handling fixes
- - -
-
-
-
2024-10-18
Joshua Watt
New
[5/6] lttng: Upgrade 2.13.14 -> 2.13.15
[1/6] oeqa/runtime/parselogs: Add differnet PCI BAR errors with qemu 9.1.0
- - -
-
-
-
2024-10-18
Richard Purdie
Under Review
[1/6] oeqa/runtime/parselogs: Add differnet PCI BAR errors with qemu 9.1.0
[1/6] oeqa/runtime/parselogs: Add differnet PCI BAR errors with qemu 9.1.0
- - -
-
-
-
2024-10-18
Richard Purdie
Under Review
[2/2] oeqa/selftest/cases/buildoptions.py: ensure libgfortran's package_qa is run
[1/2] libgfortran: fix buildpath QA issue
- - -
-
-
-
2024-10-18
ChenQi
Under Review
[styhead] oeqa/selftest/gcc: Fix kex exchange identification error
[styhead] oeqa/selftest/gcc: Fix kex exchange identification error
- - -
-
-
-
2024-10-18
Sadineni, Harish
sakoman
Accepted
[scarthgap] liba52: fix do_fetch error
[scarthgap] liba52: fix do_fetch error
- - -
-
-
-
2024-10-18
Song, Jiaying (CN)
sakoman
Accepted
[master,scarthgap] vim: Upgrade 9.1.0698 -> 9.1.0764
[master,scarthgap] vim: Upgrade 9.1.0698 -> 9.1.0764
- - -
-
-
-
2024-10-18
Rohini Sangam
Accepted
[styhead,v2] kmscube: Upgrade to latest revision
[styhead,v2] kmscube: Upgrade to latest revision
- - -
-
-
-
2024-10-17
Purushottam Choudhary
sakoman
Rejected
[v9,10/11] oeqa selftest wic.py: mark efi tests to run on x86_64 build host only
systemd uki support
- - -
-
-
-
2024-10-17
Mikko Rapeli
New
[v9,09/11] oeqa data.py: add skipIfNotBuildArch decorator
systemd uki support
- - -
-
-
-
2024-10-17
Mikko Rapeli
New
[styhead] kmscube: Upgrade to latest revision
[styhead] kmscube: Upgrade to latest revision
- - -
-
-
-
2024-10-17
Purushottam Choudhary
sakoman
Superseded
[master] alsa-lib: enabling ptest for alsa-lib component
[master] alsa-lib: enabling ptest for alsa-lib component
- - -
-
-
-
2024-10-16
aszh07
New
[scarthgap] ffmpeg: Add "libswresample libavcodec" to CVE_PRODUCT
[scarthgap] ffmpeg: Add "libswresample libavcodec" to CVE_PRODUCT
- - -
-
-
-
2024-10-16
aszh07
sakoman
Accepted
[kirkstone] ffmpeg: Add "libswresample libavcodec" to CVE_PRODUCT
[kirkstone] ffmpeg: Add "libswresample libavcodec" to CVE_PRODUCT
- - -
-
-
-
2024-10-16
aszh07
sakoman
Awaiting Upstream
bluez5: Fix the files installed in the obex package
bluez5: Fix the files installed in the obex package
- - -
-
-
-
2024-10-16
Bedel, Alban
New
tzdata&tzcode-native: upgrade 2024a -> 2024b
tzdata&tzcode-native: upgrade 2024a -> 2024b
- - -
-
-
-
2024-10-16
Wang, Jinfeng (CN)
New
[scarthgap,18/18] meta-ide-support: Mark recipe as MACHINE-specific
[scarthgap,01/18] rust: ignore CVE-2024-43402
- - -
-
-
-
2024-10-15
Steve Sakoman
sakoman
Accepted
[scarthgap,17/18] image_qa: fix error handling
[scarthgap,01/18] rust: ignore CVE-2024-43402
- - -
-
-
-
2024-10-15
Steve Sakoman
sakoman
Accepted
[scarthgap,16/18] libsdl2: Fix non-deterministic configure option for libsamplerate
[scarthgap,01/18] rust: ignore CVE-2024-43402
- - -
-
-
-
2024-10-15
Steve Sakoman
sakoman
Accepted
[scarthgap,15/18] recipes-bsp: usbutils: Fix usb-devices command using busybox
[scarthgap,01/18] rust: ignore CVE-2024-43402
- - -
-
-
-
2024-10-15
Steve Sakoman
sakoman
Accepted
[scarthgap,14/18] uboot-sign: fix counters in do_uboot_assemble_fitimage
[scarthgap,01/18] rust: ignore CVE-2024-43402
- - -
-
-
-
2024-10-15
Steve Sakoman
sakoman
Accepted
[scarthgap,13/18] runqemu: Fix detection of -serial parameter
[scarthgap,01/18] rust: ignore CVE-2024-43402
- - -
-
-
-
2024-10-15
Steve Sakoman
sakoman
Accepted
[scarthgap,12/18] makedevs: Fix matching uid/gid
[scarthgap,01/18] rust: ignore CVE-2024-43402
- - -
-
-
-
2024-10-15
Steve Sakoman
sakoman
Accepted
[scarthgap,11/18] lib/oe/package-manager: skip processing installed-pkgs with empty globs
[scarthgap,01/18] rust: ignore CVE-2024-43402
- - -
-
-
-
2024-10-15
Steve Sakoman
sakoman
Accepted
[scarthgap,10/18] virglrenderer: Add patch to fix -int-conversion build issue
[scarthgap,01/18] rust: ignore CVE-2024-43402
- - -
-
-
-
2024-10-15
Steve Sakoman
sakoman
Accepted
[scarthgap,09/18] license: Fix directory layout issues
[scarthgap,01/18] rust: ignore CVE-2024-43402
- - -
-
-
-
2024-10-15
Steve Sakoman
sakoman
Accepted
[scarthgap,08/18] libpcre2: Update base uri PhilipHazel -> PCRE2Project
[scarthgap,01/18] rust: ignore CVE-2024-43402
- - -
-
-
-
2024-10-15
Steve Sakoman
sakoman
Accepted
[scarthgap,07/18] sysvinit: take release tarballs from github
[scarthgap,01/18] rust: ignore CVE-2024-43402
- - -
-
-
-
2024-10-15
Steve Sakoman
sakoman
Accepted
[scarthgap,06/18] ptest-runner: Update 2.4.4 -> 2.4.5
[scarthgap,01/18] rust: ignore CVE-2024-43402
- - -
-
-
-
2024-10-15
Steve Sakoman
sakoman
Accepted
[scarthgap,05/18] ruby: upgrade 3.2.2 -> 3.3.5
[scarthgap,01/18] rust: ignore CVE-2024-43402
- - -
-
-
-
2024-10-15
Steve Sakoman
sakoman
Accepted
[scarthgap,04/18] linux-firmware: upgrade 20240312 -> 20240909
[scarthgap,01/18] rust: ignore CVE-2024-43402
- - -
-
-
-
2024-10-15
Steve Sakoman
sakoman
Accepted
[scarthgap,03/18] libarchive: fix CVE-2024-48957 & CVE-2024-48958
[scarthgap,01/18] rust: ignore CVE-2024-43402
- - -
-
-
-
2024-10-15
Steve Sakoman
sakoman
Accepted
[scarthgap,02/18] cups: Backport fix for CVE-2024-47175
[scarthgap,01/18] rust: ignore CVE-2024-43402
- - -
-
-
-
2024-10-15
Steve Sakoman
sakoman
Accepted
[scarthgap,01/18] rust: ignore CVE-2024-43402
[scarthgap,01/18] rust: ignore CVE-2024-43402
- - -
-
-
-
2024-10-15
Steve Sakoman
sakoman
Accepted
[AUH] ptest-runner: upgrading to 2.4.5.1 SUCCEEDED
[AUH] ptest-runner: upgrading to 2.4.5.1 SUCCEEDED
- - -
-
-
-
2024-10-15
auh@yoctoproject.org
New
[AUH] puzzles: upgrading to 182b3d9e27981c03df07cc86d8f794ad218dc350 SUCCEEDED
[AUH] puzzles: upgrading to 182b3d9e27981c03df07cc86d8f794ad218dc350 SUCCEEDED
- - -
-
-
-
2024-10-15
auh@yoctoproject.org
New
[AUH] diffoscope: upgrading to 280 SUCCEEDED
[AUH] diffoscope: upgrading to 280 SUCCEEDED
- - -
-
-
-
2024-10-15
auh@yoctoproject.org
New
[AUH] gnupg: upgrading to 2.5.1 FAILED
[AUH] gnupg: upgrading to 2.5.1 FAILED
- - -
-
-
-
2024-10-15
auh@yoctoproject.org
New
[AUH] gstreamer1.0: upgrading to 1.24.8 SUCCEEDED
[AUH] gstreamer1.0: upgrading to 1.24.8 SUCCEEDED
- - -
-
-
-
2024-10-15
auh@yoctoproject.org
New
[AUH] gstreamer1.0-vaapi: upgrading to 1.24.8 SUCCEEDED
[AUH] gstreamer1.0-vaapi: upgrading to 1.24.8 SUCCEEDED
- - -
-
-
-
2024-10-15
auh@yoctoproject.org
New
[AUH] gstreamer1.0-python: upgrading to 1.24.8 SUCCEEDED
[AUH] gstreamer1.0-python: upgrading to 1.24.8 SUCCEEDED
- - -
-
-
-
2024-10-15
auh@yoctoproject.org
New
[AUH] gstreamer1.0-libav: upgrading to 1.24.8 SUCCEEDED
[AUH] gstreamer1.0-libav: upgrading to 1.24.8 SUCCEEDED
- - -
-
-
-
2024-10-15
auh@yoctoproject.org
New
[AUH] ffmpeg: upgrading to 7.1 SUCCEEDED
[AUH] ffmpeg: upgrading to 7.1 SUCCEEDED
- - -
-
-
-
2024-10-15
auh@yoctoproject.org
New
[AUH] wayland-protocols: upgrading to 1.38 FAILED
[AUH] wayland-protocols: upgrading to 1.38 FAILED
- - -
-
-
-
2024-10-15
auh@yoctoproject.org
New
[AUH] libtraceevent: upgrading to 1.8.4 SUCCEEDED
[AUH] libtraceevent: upgrading to 1.8.4 SUCCEEDED
- - -
-
-
-
2024-10-15
auh@yoctoproject.org
New
[AUH] gst-devtools: upgrading to 1.24.8 SUCCEEDED
[AUH] gst-devtools: upgrading to 1.24.8 SUCCEEDED
- - -
-
-
-
2024-10-15
auh@yoctoproject.org
New
[AUH] dtc: upgrading to 1.7.1 FAILED
[AUH] dtc: upgrading to 1.7.1 FAILED
- - -
-
-
-
2024-10-15
auh@yoctoproject.org
New
[AUH] libinput: upgrading to 1.26.2 SUCCEEDED
[AUH] libinput: upgrading to 1.26.2 SUCCEEDED
- - -
-
-
-
2024-10-15
auh@yoctoproject.org
New
[AUH] vulkan-volk: upgrading to 1.3.296.0 SUCCEEDED
[AUH] vulkan-volk: upgrading to 1.3.296.0 SUCCEEDED
- - -
-
-
-
2024-10-15
auh@yoctoproject.org
New
[AUH] vulkan-validation-layers: upgrading to 1.3.296.0 FAILED
[AUH] vulkan-validation-layers: upgrading to 1.3.296.0 FAILED
- - -
-
-
-
2024-10-15
auh@yoctoproject.org
New
[AUH] vulkan-utility-libraries: upgrading to 1.3.296.0 FAILED
[AUH] vulkan-utility-libraries: upgrading to 1.3.296.0 FAILED
- - -
-
-
-
2024-10-15
auh@yoctoproject.org
New
[AUH] vulkan-tools: upgrading to 1.3.296.0 FAILED
[AUH] vulkan-tools: upgrading to 1.3.296.0 FAILED
- - -
-
-
-
2024-10-15
auh@yoctoproject.org
New
[AUH] vulkan-headers: upgrading to 1.3.296.0 SUCCEEDED
[AUH] vulkan-headers: upgrading to 1.3.296.0 SUCCEEDED
- - -
-
-
-
2024-10-15
auh@yoctoproject.org
New
[AUH] virglrenderer: upgrading to 1.1.0 FAILED
[AUH] virglrenderer: upgrading to 1.1.0 FAILED
- - -
-
-
-
2024-10-15
auh@yoctoproject.org
New
[AUH] spirv-headers: upgrading to 1.3.296.0 SUCCEEDED
[AUH] spirv-headers: upgrading to 1.3.296.0 SUCCEEDED
- - -
-
-
-
2024-10-15
auh@yoctoproject.org
New
[AUH] spirv-tools: upgrading to 1.3.296.0 FAILED
[AUH] spirv-tools: upgrading to 1.3.296.0 FAILED
- - -
-
-
-
2024-10-15
auh@yoctoproject.org
New
[AUH] piglit: upgrading to 7ce69da1199d12ed0ddaa251ed489750523798fb SUCCEEDED
[AUH] piglit: upgrading to 7ce69da1199d12ed0ddaa251ed489750523798fb SUCCEEDED
- - -
-
-
-
2024-10-15
auh@yoctoproject.org
New
[AUH] libxmlb: upgrading to 0.3.20 SUCCEEDED
[AUH] libxmlb: upgrading to 0.3.20 SUCCEEDED
- - -
-
-
-
2024-10-15
auh@yoctoproject.org
New
[AUH] glslang: upgrading to 1.3.296.0 SUCCEEDED
[AUH] glslang: upgrading to 1.3.296.0 SUCCEEDED
- - -
-
-
-
2024-10-15
auh@yoctoproject.org
New
[AUH] epiphany: upgrading to 47.1 SUCCEEDED
[AUH] epiphany: upgrading to 47.1 SUCCEEDED
- - -
-
-
-
2024-10-15
auh@yoctoproject.org
New
[AUH] sudo: upgrading to 1.9.16 FAILED
[AUH] sudo: upgrading to 1.9.16 FAILED
- - -
-
-
-
2024-10-15
auh@yoctoproject.org
New
[AUH] libadwaita: upgrading to 1.6.1 SUCCEEDED
[AUH] libadwaita: upgrading to 1.6.1 SUCCEEDED
- - -
-
-
-
2024-10-15
auh@yoctoproject.org
New
[AUH] stress-ng: upgrading to 0.18.05 SUCCEEDED
[AUH] stress-ng: upgrading to 0.18.05 SUCCEEDED
- - -
-
-
-
2024-10-15
auh@yoctoproject.org
New
[AUH] cups: upgrading to 2.4.11 FAILED
[AUH] cups: upgrading to 2.4.11 FAILED
- - -
-
-
-
2024-10-15
auh@yoctoproject.org
New
[AUH] libarchive: upgrading to 3.7.7 SUCCEEDED
[AUH] libarchive: upgrading to 3.7.7 SUCCEEDED
- - -
-
-
-
2024-10-15
auh@yoctoproject.org
New
[AUH] gawk: upgrading to 5.3.1 SUCCEEDED
[AUH] gawk: upgrading to 5.3.1 SUCCEEDED
- - -
-
-
-
2024-10-15
auh@yoctoproject.org
New
[AUH] bash: upgrading to 5.2.37 SUCCEEDED
[AUH] bash: upgrading to 5.2.37 SUCCEEDED
- - -
-
-
-
2024-10-15
auh@yoctoproject.org
New
[AUH] ethtool: upgrading to 6.11 SUCCEEDED
[AUH] ethtool: upgrading to 6.11 SUCCEEDED
- - -
-
-
-
2024-10-15
auh@yoctoproject.org
New
[AUH] subversion: upgrading to 1.14.4 SUCCEEDED
[AUH] subversion: upgrading to 1.14.4 SUCCEEDED
- - -
-
-
-
2024-10-15
auh@yoctoproject.org
New
[AUH] repo: upgrading to 2.48 SUCCEEDED
[AUH] repo: upgrading to 2.48 SUCCEEDED
- - -
-
-
-
2024-10-15
auh@yoctoproject.org
New
[AUH] python3-setuptools: upgrading to 75.1.0 SUCCEEDED
[AUH] python3-setuptools: upgrading to 75.1.0 SUCCEEDED
- - -
-
-
-
2024-10-15
auh@yoctoproject.org
New
[AUH] python3-trove-classifiers: upgrading to 2024.10.13 SUCCEEDED
[AUH] python3-trove-classifiers: upgrading to 2024.10.13 SUCCEEDED
- - -
-
-
-
2024-10-15
auh@yoctoproject.org
New
[AUH] python3-sphinx-rtd-theme: upgrading to 3.0.1 SUCCEEDED
[AUH] python3-sphinx-rtd-theme: upgrading to 3.0.1 SUCCEEDED
- - -
-
-
-
2024-10-15
auh@yoctoproject.org
New
[AUH] python3-urllib3: upgrading to 2.2.3 FAILED
[AUH] python3-urllib3: upgrading to 2.2.3 FAILED
- - -
-
-
-
2024-10-15
auh@yoctoproject.org
New
[AUH] python3-xmltodict: upgrading to 0.14.1 SUCCEEDED
[AUH] python3-xmltodict: upgrading to 0.14.1 SUCCEEDED
- - -
-
-
-
2024-10-15
auh@yoctoproject.org
New
[AUH] python3-sphinx: upgrading to 8.1.3 SUCCEEDED
[AUH] python3-sphinx: upgrading to 8.1.3 SUCCEEDED
- - -
-
-
-
2024-10-15
auh@yoctoproject.org
New
[AUH] python3-pyproject-metadata: upgrading to 0.8.1 SUCCEEDED
[AUH] python3-pyproject-metadata: upgrading to 0.8.1 SUCCEEDED
- - -
-
-
-
2024-10-15
auh@yoctoproject.org
New
[AUH] python3-pyparsing: upgrading to 3.2.0 SUCCEEDED
[AUH] python3-pyparsing: upgrading to 3.2.0 SUCCEEDED
- - -
-
-
-
2024-10-15
auh@yoctoproject.org
New
[AUH] python3-poetry-core: upgrading to 1.9.1 SUCCEEDED
[AUH] python3-poetry-core: upgrading to 1.9.1 SUCCEEDED
- - -
-
-
-
2024-10-15
auh@yoctoproject.org
New
[AUH] python3-numpy: upgrading to 2.1.2 FAILED
[AUH] python3-numpy: upgrading to 2.1.2 FAILED
- - -
-
-
-
2024-10-15
auh@yoctoproject.org
New
[AUH] python3-cryptography: upgrading to 43.0.1 FAILED
[AUH] python3-cryptography: upgrading to 43.0.1 FAILED
- - -
-
-
-
2024-10-15
auh@yoctoproject.org
New
[AUH] python3-isodate: upgrading to 0.7.2 FAILED
[AUH] python3-isodate: upgrading to 0.7.2 FAILED
- - -
-
-
-
2024-10-15
auh@yoctoproject.org
New
[AUH] python3-hypothesis: upgrading to 6.115.2 SUCCEEDED
[AUH] python3-hypothesis: upgrading to 6.115.2 SUCCEEDED
- - -
-
-
-
2024-10-15
auh@yoctoproject.org
New
[AUH] python3-jsonschema-specifications: upgrading to 2024.10.1 SUCCEEDED
[AUH] python3-jsonschema-specifications: upgrading to 2024.10.1 SUCCEEDED
- - -
-
-
-
2024-10-15
auh@yoctoproject.org
New
[AUH] python3-beartype: upgrading to 0.19.0 FAILED
[AUH] python3-beartype: upgrading to 0.19.0 FAILED
- - -
-
-
-
2024-10-15
auh@yoctoproject.org
New
[AUH] libtry-tiny-perl: upgrading to 0.32 SUCCEEDED
[AUH] libtry-tiny-perl: upgrading to 0.32 SUCCEEDED
- - -
-
-
-
2024-10-15
auh@yoctoproject.org
New
[AUH] mtd-utils: upgrading to 2.2.1 SUCCEEDED
[AUH] mtd-utils: upgrading to 2.2.1 SUCCEEDED
- - -
-
-
-
2024-10-15
auh@yoctoproject.org
New
[AUH] liburi-perl: upgrading to 5.30 SUCCEEDED
[AUH] liburi-perl: upgrading to 5.30 SUCCEEDED
- - -
-
-
-
2024-10-15
auh@yoctoproject.org
New
[AUH] llvm: upgrading to 19.1.1 SUCCEEDED
[AUH] llvm: upgrading to 19.1.1 SUCCEEDED
- - -
-
-
-
2024-10-15
auh@yoctoproject.org
New
«
1
2
...
25
26
27
…
124
125
»