Show patches with: State = Action Required       |   9381 patches
« 1 2 3 493 94 »
Patch Series A/R/T S/W/F Date Submitter Delegate State
oeqa/runtime: fix race-condition in minidebuginfo test oeqa/runtime: fix race-condition in minidebuginfo test - - - --- 2024-06-10 Etienne Cordonnier New
[PATCHv3] xcb-util-errors: add recipe [PATCHv3] xcb-util-errors: add recipe - - - --- 2024-06-10 Markus Volk New
systemtap: fix systemtap-native build error on Fedora 40 systemtap: fix systemtap-native build error on Fedora 40 - - - --- 2024-06-10 Victor Kamensky New
gstreamer1.0-plugins-bad: drop PACKAGECONFIG for sctp and srtp gstreamer1.0-plugins-bad: drop PACKAGECONFIG for sctp and srtp - - - --- 2024-06-09 Markus Volk New
[v2] cve-check: Introduce CVE_CHECK_MANIFEST_JSON_SUFFIX [v2] cve-check: Introduce CVE_CHECK_MANIFEST_JSON_SUFFIX - - - --- 2024-06-09 Aleksandar Nikolic New
cve-check: Introduce CVE_CHECK_MANIFEST_JSON_SUFFIX cve-check: Introduce CVE_CHECK_MANIFEST_JSON_SUFFIX - - - --- 2024-06-09 Aleksandar Nikolic New
ell: update 0.65 -> 0.66 ell: update 0.65 -> 0.66 - - - --- 2024-06-09 Markus Volk New
classes/kernel: No symlink in postinst without KERNEL_IMAGETYPE_SYMLINK classes/kernel: No symlink in postinst without KERNEL_IMAGETYPE_SYMLINK - - - --- 2024-06-09 Jörg Sommer New
[v1,2/2] systemd: bpf-framework: pass STAGING_INCDIR to eBPF compiler Untitled series #25492 - - - --- 2024-06-09 SCHNEIDER Johannes New
[v1,2/2] systemd: bpf-framework: pass STAGING_INCDIR to eBPF compiler systemd and RestrictNetworkInterfaces - - - --- 2024-06-09 SCHNEIDER Johannes New
[v1,1/2] systemd: add PACKAGECONFIG for bpf-framework systemd and RestrictNetworkInterfaces - - - --- 2024-06-09 SCHNEIDER Johannes New
[kirkstone] glib-2.0: patch CVE-2024-34397 [kirkstone] glib-2.0: patch CVE-2024-34397 - - - --- 2024-06-08 Marko, Peter sakoman Under Review
[kirkstone] ffmpeg: Whitelist CVE-2023-46407 [kirkstone] ffmpeg: Whitelist CVE-2023-46407 - - - --- 2024-06-07 Nikhil R New
site/riscv*-linux: add ac_cv_func_fnmatch_works site/riscv*-linux: add ac_cv_func_fnmatch_works - - - --- 2024-06-07 Dmitry Baryshkov New
archiver.bbclass: Fix work-shared checking for kernel recipes archiver.bbclass: Fix work-shared checking for kernel recipes - - - --- 2024-06-06 Livius New
[v2] gcc: Fix wrong order of gcc include paths on musl systems [v2] gcc: Fix wrong order of gcc include paths on musl systems - - - --- 2024-06-06 Khem Raj New
[RFC,2/2] classes-global/base: Add manifest to do_unpack Write out file manifest in do_unpack - - - --- 2024-06-06 Joshua Watt New
[RFC,1/2] utils: Add write_files_manifest helper Write out file manifest in do_unpack - - - --- 2024-06-06 Joshua Watt New
[PATCHv3] libgcrypt: Fix building error with '-O2' in sysroot path [PATCHv3] libgcrypt: Fix building error with '-O2' in sysroot path - - - --- 2024-06-06 simit.ghane New
[PATCHv2] Fix building error with '-O2' in sysroot path [PATCHv2] Fix building error with '-O2' in sysroot path - - - --- 2024-06-06 simit.ghane New
[kirkstone,2/2] man-pages: remove conflict pages man-pages: backport libxcrypt conflict fixes - - - --- 2024-06-06 Jonas Gorski sakoman Under Review
[kirkstone,1/2] man-pages: add an alternative link name for crypt_r.3 man-pages: backport libxcrypt conflict fixes - - - --- 2024-06-06 Jonas Gorski sakoman Under Review
gcc: Fix wrong order of gcc include paths on musl systems gcc: Fix wrong order of gcc include paths on musl systems - - - --- 2024-06-06 Khem Raj New
[v4,2/2] insane: add patch-status to default ERROR_QA [v4,1/2] selftest: add Upstream-Status to .patch files - - - --- 2024-06-05 Martin Jansa New
[v4,1/2] selftest: add Upstream-Status to .patch files [v4,1/2] selftest: add Upstream-Status to .patch files - - - --- 2024-06-05 Martin Jansa New
linuxloader: add -armhf on arm only for TARGET_FPU 'hard' linuxloader: add -armhf on arm only for TARGET_FPU 'hard' - - - --- 2024-06-05 Jonas Gorski New
[1/2] python3: Check for host OS type instead of build OS [1/2] python3: Check for host OS type instead of build OS - - - --- 2024-06-05 Khem Raj New
[kirkstone] openssl: Upgrade 3.0.13 -> 3.0.14 [kirkstone] openssl: Upgrade 3.0.13 -> 3.0.14 - - - --- 2024-06-04 Siddharth sakoman Under Review
iptables: fix save/restore symlinks with libnftnl PACKAGECONFIG enabled iptables: fix save/restore symlinks with libnftnl PACKAGECONFIG enabled - - - --- 2024-06-04 kiriyatsenko@gmail.com New
[RESENDv4,4/4] insane: add patch-status to default ERROR_QA [RESENDv4,1/4] selftest: gitrepotest: add Upstream-Status to 0001-testpatch.patch - - - --- 2024-06-04 Martin Jansa New
[RESENDv4,3/4] selftest: add few missing Upstream-Status found by patchreview [RESENDv4,1/4] selftest: gitrepotest: add Upstream-Status to 0001-testpatch.patch - - - --- 2024-06-04 Martin Jansa New
[RESENDv4,2/4] selftest: add few missing Upstream-Status [RESENDv4,1/4] selftest: gitrepotest: add Upstream-Status to 0001-testpatch.patch - - - --- 2024-06-04 Martin Jansa New
[RESENDv4,1/4] selftest: gitrepotest: add Upstream-Status to 0001-testpatch.patch [RESENDv4,1/4] selftest: gitrepotest: add Upstream-Status to 0001-testpatch.patch - - - --- 2024-06-04 Martin Jansa New
[RESENDv3,4/4] insane: add patch-status to default ERROR_QA [RESENDv3,1/4] selftest: gitrepotest: add Upstream-Status to 0001-testpatch.patch - - - --- 2024-06-04 Martin Jansa New
[RESENDv3,3/4] selftest: add few missing Upstream-Status found by patchreview [RESENDv3,1/4] selftest: gitrepotest: add Upstream-Status to 0001-testpatch.patch - - - --- 2024-06-04 Martin Jansa New
[RESENDv3,2/4] selftest: add few missing Upstream-Status [RESENDv3,1/4] selftest: gitrepotest: add Upstream-Status to 0001-testpatch.patch - - - --- 2024-06-04 Martin Jansa New
[RESENDv3,1/4] selftest: gitrepotest: add Upstream-Status to 0001-testpatch.patch [RESENDv3,1/4] selftest: gitrepotest: add Upstream-Status to 0001-testpatch.patch - - - --- 2024-06-04 Martin Jansa New
[v11,3/3] classes: add a systemd-sysext image class pkg-database and systemd-sysext image - - - --- 2024-06-04 SCHNEIDER Johannes New
[v11,2/3] image.bbclass/rootfs: set and unpack package-database pkg-database and systemd-sysext image - - - --- 2024-06-04 SCHNEIDER Johannes New
[v11,1/3] image.bbclass/rootfs: archive and deploy package database pkg-database and systemd-sysext image - - - --- 2024-06-04 SCHNEIDER Johannes New
cmake-qemu.bbclass: fix if criterion cmake-qemu.bbclass: fix if criterion - - - --- 2024-06-04 Kai New
[meta-oe] python3-pytest-html: add missing runtime dependencies [meta-oe] python3-pytest-html: add missing runtime dependencies - - - --- 2024-06-03 Grygorii Tertychnyi New
python3-rpds-py: Create a symlink for cython module on musl python3-rpds-py: Create a symlink for cython module on musl - - - --- 2024-06-03 Khem Raj New
[v3] pciutils: rewrite recipe [v3] pciutils: rewrite recipe - - - --- 2024-06-03 Ross Burton New
rust: rustdoc reproducibility - disable PGO rust: rustdoc reproducibility - disable PGO - - - --- 2024-06-03 Sundeep KOKKONDA New
[PATCHv2] xcb-util-errors: add recipe [PATCHv2] xcb-util-errors: add recipe - - - --- 2024-06-03 Markus Volk New
xcb-util-errors: add recipe xcb-util-errors: add recipe - - - --- 2024-06-03 Markus Volk New
python3-babel: upgrade 2.14.0 -> 2.15.0 python3-babel: upgrade 2.14.0 -> 2.15.0 - - - --- 2024-06-03 Tim Orling New
python3-meson-python: ugprade 0.15.0 -> 0.16.0 python3-meson-python: ugprade 0.15.0 -> 0.16.0 - - - --- 2024-06-02 Tim Orling New
[RFC,5/5] oe-selftest: add RECIPE_UPDATE_EXTRA_TASKS test [RFC,1/5] devtool upgrade: enable RECIPE_UPDATE_EXTRA_TASKS - - - --- 2024-06-02 Tim Orling New
[RFC,4/5] meta-selftest: add python3-guessing-game [RFC,1/5] devtool upgrade: enable RECIPE_UPDATE_EXTRA_TASKS - - - --- 2024-06-02 Tim Orling New
[RFC,3/5] ref-manual: add RECIPE_UPDATE_EXTRA_TASKS variable [RFC,1/5] devtool upgrade: enable RECIPE_UPDATE_EXTRA_TASKS - - - --- 2024-06-02 Tim Orling New
[RFC,2/5] cargo-update-recipe-crates: add RECIPE_UPDATE_EXTRA_TASKS [RFC,1/5] devtool upgrade: enable RECIPE_UPDATE_EXTRA_TASKS - - - --- 2024-06-02 Tim Orling New
[RFC,1/5] devtool upgrade: enable RECIPE_UPDATE_EXTRA_TASKS [RFC,1/5] devtool upgrade: enable RECIPE_UPDATE_EXTRA_TASKS - - - --- 2024-06-02 Tim Orling New
python3-pygments: added rdepends python3-pygments: added rdepends - - - --- 2024-06-02 Jan Vermaete New
grub,grub-efi: Remove -mfpmath=sse on x86 grub,grub-efi: Remove -mfpmath=sse on x86 - - - --- 2024-06-01 Khem Raj New
[AUH] puzzles: upgrading to fd304c53cc45dc05b3f95c20a466e20a7e1c9194 SUCCEEDED [AUH] puzzles: upgrading to fd304c53cc45dc05b3f95c20a466e20a7e1c9194 SUCCEEDED - - - --- 2024-06-01 auh@yoctoproject.org New
[AUH] vte: upgrading to 0.76.2 FAILED [AUH] vte: upgrading to 0.76.2 FAILED - - - --- 2024-06-01 auh@yoctoproject.org New
[AUH] hwlatdetect: upgrading to 2.7 SUCCEEDED [AUH] hwlatdetect: upgrading to 2.7 SUCCEEDED - - - --- 2024-06-01 auh@yoctoproject.org New
[AUH] libva: upgrading to 2.21.0 FAILED [AUH] libva: upgrading to 2.21.0 FAILED - - - --- 2024-06-01 auh@yoctoproject.org New
[AUH] gstreamer1.0-python: upgrading to 1.24.4 SUCCEEDED [AUH] gstreamer1.0-python: upgrading to 1.24.4 SUCCEEDED - - - --- 2024-06-01 auh@yoctoproject.org New
[AUH] gstreamer1.0-rtsp-server: upgrading to 1.24.4 SUCCEEDED [AUH] gstreamer1.0-rtsp-server: upgrading to 1.24.4 SUCCEEDED - - - --- 2024-06-01 auh@yoctoproject.org New
[AUH] enchant2: upgrading to 2.8.0 SUCCEEDED [AUH] enchant2: upgrading to 2.8.0 SUCCEEDED - - - --- 2024-06-01 auh@yoctoproject.org New
[AUH] rng-tools: upgrading to 6.17 SUCCEEDED [AUH] rng-tools: upgrading to 6.17 SUCCEEDED - - - --- 2024-06-01 auh@yoctoproject.org New
[AUH] gstreamer1.0-plugins-ugly: upgrading to 1.24.4 SUCCEEDED [AUH] gstreamer1.0-plugins-ugly: upgrading to 1.24.4 SUCCEEDED - - - --- 2024-06-01 auh@yoctoproject.org New
[AUH] diffoscope: upgrading to 269 SUCCEEDED [AUH] diffoscope: upgrading to 269 SUCCEEDED - - - --- 2024-06-01 auh@yoctoproject.org New
[AUH] weston: upgrading to 13.0.1 SUCCEEDED [AUH] weston: upgrading to 13.0.1 SUCCEEDED - - - --- 2024-06-01 auh@yoctoproject.org New
[AUH] gstreamer1.0-plugins-good: upgrading to 1.24.4 SUCCEEDED [AUH] gstreamer1.0-plugins-good: upgrading to 1.24.4 SUCCEEDED - - - --- 2024-06-01 auh@yoctoproject.org New
[AUH] gstreamer1.0-vaapi: upgrading to 1.24.4 SUCCEEDED [AUH] gstreamer1.0-vaapi: upgrading to 1.24.4 SUCCEEDED - - - --- 2024-06-01 auh@yoctoproject.org New
[AUH] libcap: upgrading to 2.70 SUCCEEDED [AUH] libcap: upgrading to 2.70 SUCCEEDED - - - --- 2024-06-01 auh@yoctoproject.org New
[AUH] gstreamer1.0: upgrading to 1.24.4 SUCCEEDED [AUH] gstreamer1.0: upgrading to 1.24.4 SUCCEEDED - - - --- 2024-06-01 auh@yoctoproject.org New
[AUH] sqlite3: upgrading to 3.46.0 SUCCEEDED [AUH] sqlite3: upgrading to 3.46.0 SUCCEEDED - - - --- 2024-06-01 auh@yoctoproject.org New
[AUH] libevdev: upgrading to 1.13.2 SUCCEEDED [AUH] libevdev: upgrading to 1.13.2 SUCCEEDED - - - --- 2024-06-01 auh@yoctoproject.org New
[AUH] nghttp2: upgrading to 1.62.1 SUCCEEDED [AUH] nghttp2: upgrading to 1.62.1 SUCCEEDED - - - --- 2024-06-01 auh@yoctoproject.org New
[AUH] ethtool: upgrading to 6.9 SUCCEEDED [AUH] ethtool: upgrading to 6.9 SUCCEEDED - - - --- 2024-06-01 auh@yoctoproject.org New
[AUH] libva-initial: upgrading to 2.21.0 FAILED [AUH] libva-initial: upgrading to 2.21.0 FAILED - - - --- 2024-06-01 auh@yoctoproject.org New
[AUH] python3-requests: upgrading to 2.32.3 SUCCEEDED [AUH] python3-requests: upgrading to 2.32.3 SUCCEEDED - - - --- 2024-06-01 auh@yoctoproject.org New
[AUH] xmlto: upgrading to 635dcd5bc84a7b67a3a2050a179d96e1d3050b15 FAILED [AUH] xmlto: upgrading to 635dcd5bc84a7b67a3a2050a179d96e1d3050b15 FAILED - - - --- 2024-06-01 auh@yoctoproject.org New
[AUH] librsvg: upgrading to 2.58.1 FAILED [AUH] librsvg: upgrading to 2.58.1 FAILED - - - --- 2024-06-01 auh@yoctoproject.org New
[AUH] python3-uritools: upgrading to 4.0.3 SUCCEEDED [AUH] python3-uritools: upgrading to 4.0.3 SUCCEEDED - - - --- 2024-06-01 auh@yoctoproject.org New
[AUH] wayland: upgrading to 1.23.0 SUCCEEDED [AUH] wayland: upgrading to 1.23.0 SUCCEEDED - - - --- 2024-06-01 auh@yoctoproject.org New
[AUH] lttng-modules: upgrading to 2.13.13 FAILED [AUH] lttng-modules: upgrading to 2.13.13 FAILED - - - --- 2024-06-01 auh@yoctoproject.org New
[AUH] xz: upgrading to 5.6.2 SUCCEEDED [AUH] xz: upgrading to 5.6.2 SUCCEEDED - - - --- 2024-06-01 auh@yoctoproject.org New
[AUH] gst-devtools: upgrading to 1.24.4 SUCCEEDED [AUH] gst-devtools: upgrading to 1.24.4 SUCCEEDED - - - --- 2024-06-01 auh@yoctoproject.org New
[AUH] hicolor-icon-theme: upgrading to 0.18 FAILED [AUH] hicolor-icon-theme: upgrading to 0.18 FAILED - - - --- 2024-06-01 auh@yoctoproject.org New
[AUH] adwaita-icon-theme: upgrading to 46.2 FAILED [AUH] adwaita-icon-theme: upgrading to 46.2 FAILED - - - --- 2024-06-01 auh@yoctoproject.org New
[AUH] gstreamer1.0-libav: upgrading to 1.24.4 SUCCEEDED [AUH] gstreamer1.0-libav: upgrading to 1.24.4 SUCCEEDED - - - --- 2024-06-01 auh@yoctoproject.org New
[AUH] ruby: upgrading to 3.3.1 SUCCEEDED [AUH] ruby: upgrading to 3.3.1 SUCCEEDED - - - --- 2024-06-01 auh@yoctoproject.org New
[AUH] python3-zipp: upgrading to 3.19.1 SUCCEEDED [AUH] python3-zipp: upgrading to 3.19.1 SUCCEEDED - - - --- 2024-06-01 auh@yoctoproject.org New
[AUH] ltp: upgrading to 20240524 SUCCEEDED [AUH] ltp: upgrading to 20240524 SUCCEEDED - - - --- 2024-06-01 auh@yoctoproject.org New
[AUH] python3-setuptools: upgrading to 70.0.0 SUCCEEDED [AUH] python3-setuptools: upgrading to 70.0.0 SUCCEEDED - - - --- 2024-06-01 auh@yoctoproject.org New
[AUH] epiphany: upgrading to 46.1 SUCCEEDED [AUH] epiphany: upgrading to 46.1 SUCCEEDED - - - --- 2024-06-01 auh@yoctoproject.org New
[AUH] gstreamer1.0-plugins-base: upgrading to 1.24.4 SUCCEEDED [AUH] gstreamer1.0-plugins-base: upgrading to 1.24.4 SUCCEEDED - - - --- 2024-06-01 auh@yoctoproject.org New
[AUH] gi-docgen: upgrading to 2024.1 SUCCEEDED [AUH] gi-docgen: upgrading to 2024.1 SUCCEEDED - - - --- 2024-06-01 auh@yoctoproject.org New
[AUH] gstreamer1.0-plugins-bad: upgrading to 1.24.4 SUCCEEDED [AUH] gstreamer1.0-plugins-bad: upgrading to 1.24.4 SUCCEEDED - - - --- 2024-06-01 auh@yoctoproject.org New
[AUH] ttyrun: upgrading to 2.33.1 SUCCEEDED [AUH] ttyrun: upgrading to 2.33.1 SUCCEEDED - - - --- 2024-06-01 auh@yoctoproject.org New
[AUH] nasm: upgrading to 2.16.03 SUCCEEDED [AUH] nasm: upgrading to 2.16.03 SUCCEEDED - - - --- 2024-06-01 auh@yoctoproject.org New
[AUH] glib-networking: upgrading to 2.80.0 SUCCEEDED [AUH] glib-networking: upgrading to 2.80.0 SUCCEEDED - - - --- 2024-06-01 auh@yoctoproject.org New
[AUH] systemd-boot: upgrading to 255.7 SUCCEEDED [AUH] systemd-boot: upgrading to 255.7 SUCCEEDED - - - --- 2024-06-01 auh@yoctoproject.org New
[AUH] ifupdown: upgrading to 0.8.43 FAILED [AUH] ifupdown: upgrading to 0.8.43 FAILED - - - --- 2024-06-01 auh@yoctoproject.org New
« 1 2 3 493 94 »