Show patches with: State = Action Required       |   9250 patches
« 1 2 3 492 93 »
Patch Series A/R/T S/W/F Date Submitter Delegate State
[RESENDv4,2/4] selftest: add few missing Upstream-Status [RESENDv4,1/4] selftest: gitrepotest: add Upstream-Status to 0001-testpatch.patch - - - --- 2024-06-04 Martin Jansa New
[RESENDv4,1/4] selftest: gitrepotest: add Upstream-Status to 0001-testpatch.patch [RESENDv4,1/4] selftest: gitrepotest: add Upstream-Status to 0001-testpatch.patch - - - --- 2024-06-04 Martin Jansa New
[RESENDv3,4/4] insane: add patch-status to default ERROR_QA [RESENDv3,1/4] selftest: gitrepotest: add Upstream-Status to 0001-testpatch.patch - - - --- 2024-06-04 Martin Jansa New
[RESENDv3,3/4] selftest: add few missing Upstream-Status found by patchreview [RESENDv3,1/4] selftest: gitrepotest: add Upstream-Status to 0001-testpatch.patch - - - --- 2024-06-04 Martin Jansa New
[RESENDv3,2/4] selftest: add few missing Upstream-Status [RESENDv3,1/4] selftest: gitrepotest: add Upstream-Status to 0001-testpatch.patch - - - --- 2024-06-04 Martin Jansa New
[RESENDv3,1/4] selftest: gitrepotest: add Upstream-Status to 0001-testpatch.patch [RESENDv3,1/4] selftest: gitrepotest: add Upstream-Status to 0001-testpatch.patch - - - --- 2024-06-04 Martin Jansa New
[v11,3/3] classes: add a systemd-sysext image class pkg-database and systemd-sysext image - - - --- 2024-06-04 SCHNEIDER Johannes New
[v11,2/3] image.bbclass/rootfs: set and unpack package-database pkg-database and systemd-sysext image - - - --- 2024-06-04 SCHNEIDER Johannes New
[v11,1/3] image.bbclass/rootfs: archive and deploy package database pkg-database and systemd-sysext image - - - --- 2024-06-04 SCHNEIDER Johannes New
cmake-qemu.bbclass: fix if criterion cmake-qemu.bbclass: fix if criterion - - - --- 2024-06-04 Kai New
[meta-oe] python3-pytest-html: add missing runtime dependencies [meta-oe] python3-pytest-html: add missing runtime dependencies - - - --- 2024-06-03 Grygorii Tertychnyi New
python3-rpds-py: Create a symlink for cython module on musl python3-rpds-py: Create a symlink for cython module on musl - - - --- 2024-06-03 Khem Raj New
[v3] pciutils: rewrite recipe [v3] pciutils: rewrite recipe - - - --- 2024-06-03 Ross Burton New
rust: rustdoc reproducibility - disable PGO rust: rustdoc reproducibility - disable PGO - - - --- 2024-06-03 Sundeep KOKKONDA New
[PATCHv2] xcb-util-errors: add recipe [PATCHv2] xcb-util-errors: add recipe - - - --- 2024-06-03 Markus Volk New
xcb-util-errors: add recipe xcb-util-errors: add recipe - - - --- 2024-06-03 Markus Volk New
python3-babel: upgrade 2.14.0 -> 2.15.0 python3-babel: upgrade 2.14.0 -> 2.15.0 - - - --- 2024-06-03 Tim Orling New
python3-meson-python: ugprade 0.15.0 -> 0.16.0 python3-meson-python: ugprade 0.15.0 -> 0.16.0 - - - --- 2024-06-02 Tim Orling New
[RFC,5/5] oe-selftest: add RECIPE_UPDATE_EXTRA_TASKS test [RFC,1/5] devtool upgrade: enable RECIPE_UPDATE_EXTRA_TASKS - - - --- 2024-06-02 Tim Orling New
[RFC,4/5] meta-selftest: add python3-guessing-game [RFC,1/5] devtool upgrade: enable RECIPE_UPDATE_EXTRA_TASKS - - - --- 2024-06-02 Tim Orling New
[RFC,3/5] ref-manual: add RECIPE_UPDATE_EXTRA_TASKS variable [RFC,1/5] devtool upgrade: enable RECIPE_UPDATE_EXTRA_TASKS - - - --- 2024-06-02 Tim Orling New
[RFC,2/5] cargo-update-recipe-crates: add RECIPE_UPDATE_EXTRA_TASKS [RFC,1/5] devtool upgrade: enable RECIPE_UPDATE_EXTRA_TASKS - - - --- 2024-06-02 Tim Orling New
[RFC,1/5] devtool upgrade: enable RECIPE_UPDATE_EXTRA_TASKS [RFC,1/5] devtool upgrade: enable RECIPE_UPDATE_EXTRA_TASKS - - - --- 2024-06-02 Tim Orling New
python3-pygments: added rdepends python3-pygments: added rdepends - - - --- 2024-06-02 Jan Vermaete New
grub,grub-efi: Remove -mfpmath=sse on x86 grub,grub-efi: Remove -mfpmath=sse on x86 - - - --- 2024-06-01 Khem Raj New
[AUH] puzzles: upgrading to fd304c53cc45dc05b3f95c20a466e20a7e1c9194 SUCCEEDED [AUH] puzzles: upgrading to fd304c53cc45dc05b3f95c20a466e20a7e1c9194 SUCCEEDED - - - --- 2024-06-01 auh@yoctoproject.org New
[AUH] vte: upgrading to 0.76.2 FAILED [AUH] vte: upgrading to 0.76.2 FAILED - - - --- 2024-06-01 auh@yoctoproject.org New
[AUH] hwlatdetect: upgrading to 2.7 SUCCEEDED [AUH] hwlatdetect: upgrading to 2.7 SUCCEEDED - - - --- 2024-06-01 auh@yoctoproject.org New
[AUH] libva: upgrading to 2.21.0 FAILED [AUH] libva: upgrading to 2.21.0 FAILED - - - --- 2024-06-01 auh@yoctoproject.org New
[AUH] gstreamer1.0-python: upgrading to 1.24.4 SUCCEEDED [AUH] gstreamer1.0-python: upgrading to 1.24.4 SUCCEEDED - - - --- 2024-06-01 auh@yoctoproject.org New
[AUH] gstreamer1.0-rtsp-server: upgrading to 1.24.4 SUCCEEDED [AUH] gstreamer1.0-rtsp-server: upgrading to 1.24.4 SUCCEEDED - - - --- 2024-06-01 auh@yoctoproject.org New
[AUH] enchant2: upgrading to 2.8.0 SUCCEEDED [AUH] enchant2: upgrading to 2.8.0 SUCCEEDED - - - --- 2024-06-01 auh@yoctoproject.org New
[AUH] rng-tools: upgrading to 6.17 SUCCEEDED [AUH] rng-tools: upgrading to 6.17 SUCCEEDED - - - --- 2024-06-01 auh@yoctoproject.org New
[AUH] gstreamer1.0-plugins-ugly: upgrading to 1.24.4 SUCCEEDED [AUH] gstreamer1.0-plugins-ugly: upgrading to 1.24.4 SUCCEEDED - - - --- 2024-06-01 auh@yoctoproject.org New
[AUH] diffoscope: upgrading to 269 SUCCEEDED [AUH] diffoscope: upgrading to 269 SUCCEEDED - - - --- 2024-06-01 auh@yoctoproject.org New
[AUH] weston: upgrading to 13.0.1 SUCCEEDED [AUH] weston: upgrading to 13.0.1 SUCCEEDED - - - --- 2024-06-01 auh@yoctoproject.org New
[AUH] gstreamer1.0-plugins-good: upgrading to 1.24.4 SUCCEEDED [AUH] gstreamer1.0-plugins-good: upgrading to 1.24.4 SUCCEEDED - - - --- 2024-06-01 auh@yoctoproject.org New
[AUH] gstreamer1.0-vaapi: upgrading to 1.24.4 SUCCEEDED [AUH] gstreamer1.0-vaapi: upgrading to 1.24.4 SUCCEEDED - - - --- 2024-06-01 auh@yoctoproject.org New
[AUH] libcap: upgrading to 2.70 SUCCEEDED [AUH] libcap: upgrading to 2.70 SUCCEEDED - - - --- 2024-06-01 auh@yoctoproject.org New
[AUH] gstreamer1.0: upgrading to 1.24.4 SUCCEEDED [AUH] gstreamer1.0: upgrading to 1.24.4 SUCCEEDED - - - --- 2024-06-01 auh@yoctoproject.org New
[AUH] sqlite3: upgrading to 3.46.0 SUCCEEDED [AUH] sqlite3: upgrading to 3.46.0 SUCCEEDED - - - --- 2024-06-01 auh@yoctoproject.org New
[AUH] libevdev: upgrading to 1.13.2 SUCCEEDED [AUH] libevdev: upgrading to 1.13.2 SUCCEEDED - - - --- 2024-06-01 auh@yoctoproject.org New
[AUH] nghttp2: upgrading to 1.62.1 SUCCEEDED [AUH] nghttp2: upgrading to 1.62.1 SUCCEEDED - - - --- 2024-06-01 auh@yoctoproject.org New
[AUH] ethtool: upgrading to 6.9 SUCCEEDED [AUH] ethtool: upgrading to 6.9 SUCCEEDED - - - --- 2024-06-01 auh@yoctoproject.org New
[AUH] libva-initial: upgrading to 2.21.0 FAILED [AUH] libva-initial: upgrading to 2.21.0 FAILED - - - --- 2024-06-01 auh@yoctoproject.org New
[AUH] python3-requests: upgrading to 2.32.3 SUCCEEDED [AUH] python3-requests: upgrading to 2.32.3 SUCCEEDED - - - --- 2024-06-01 auh@yoctoproject.org New
[AUH] xmlto: upgrading to 635dcd5bc84a7b67a3a2050a179d96e1d3050b15 FAILED [AUH] xmlto: upgrading to 635dcd5bc84a7b67a3a2050a179d96e1d3050b15 FAILED - - - --- 2024-06-01 auh@yoctoproject.org New
[AUH] librsvg: upgrading to 2.58.1 FAILED [AUH] librsvg: upgrading to 2.58.1 FAILED - - - --- 2024-06-01 auh@yoctoproject.org New
[AUH] python3-uritools: upgrading to 4.0.3 SUCCEEDED [AUH] python3-uritools: upgrading to 4.0.3 SUCCEEDED - - - --- 2024-06-01 auh@yoctoproject.org New
[AUH] wayland: upgrading to 1.23.0 SUCCEEDED [AUH] wayland: upgrading to 1.23.0 SUCCEEDED - - - --- 2024-06-01 auh@yoctoproject.org New
[AUH] lttng-modules: upgrading to 2.13.13 FAILED [AUH] lttng-modules: upgrading to 2.13.13 FAILED - - - --- 2024-06-01 auh@yoctoproject.org New
[AUH] xz: upgrading to 5.6.2 SUCCEEDED [AUH] xz: upgrading to 5.6.2 SUCCEEDED - - - --- 2024-06-01 auh@yoctoproject.org New
[AUH] gst-devtools: upgrading to 1.24.4 SUCCEEDED [AUH] gst-devtools: upgrading to 1.24.4 SUCCEEDED - - - --- 2024-06-01 auh@yoctoproject.org New
[AUH] hicolor-icon-theme: upgrading to 0.18 FAILED [AUH] hicolor-icon-theme: upgrading to 0.18 FAILED - - - --- 2024-06-01 auh@yoctoproject.org New
[AUH] adwaita-icon-theme: upgrading to 46.2 FAILED [AUH] adwaita-icon-theme: upgrading to 46.2 FAILED - - - --- 2024-06-01 auh@yoctoproject.org New
[AUH] gstreamer1.0-libav: upgrading to 1.24.4 SUCCEEDED [AUH] gstreamer1.0-libav: upgrading to 1.24.4 SUCCEEDED - - - --- 2024-06-01 auh@yoctoproject.org New
[AUH] ruby: upgrading to 3.3.1 SUCCEEDED [AUH] ruby: upgrading to 3.3.1 SUCCEEDED - - - --- 2024-06-01 auh@yoctoproject.org New
[AUH] python3-zipp: upgrading to 3.19.1 SUCCEEDED [AUH] python3-zipp: upgrading to 3.19.1 SUCCEEDED - - - --- 2024-06-01 auh@yoctoproject.org New
[AUH] ltp: upgrading to 20240524 SUCCEEDED [AUH] ltp: upgrading to 20240524 SUCCEEDED - - - --- 2024-06-01 auh@yoctoproject.org New
[AUH] python3-setuptools: upgrading to 70.0.0 SUCCEEDED [AUH] python3-setuptools: upgrading to 70.0.0 SUCCEEDED - - - --- 2024-06-01 auh@yoctoproject.org New
[AUH] epiphany: upgrading to 46.1 SUCCEEDED [AUH] epiphany: upgrading to 46.1 SUCCEEDED - - - --- 2024-06-01 auh@yoctoproject.org New
[AUH] gstreamer1.0-plugins-base: upgrading to 1.24.4 SUCCEEDED [AUH] gstreamer1.0-plugins-base: upgrading to 1.24.4 SUCCEEDED - - - --- 2024-06-01 auh@yoctoproject.org New
[AUH] gi-docgen: upgrading to 2024.1 SUCCEEDED [AUH] gi-docgen: upgrading to 2024.1 SUCCEEDED - - - --- 2024-06-01 auh@yoctoproject.org New
[AUH] gstreamer1.0-plugins-bad: upgrading to 1.24.4 SUCCEEDED [AUH] gstreamer1.0-plugins-bad: upgrading to 1.24.4 SUCCEEDED - - - --- 2024-06-01 auh@yoctoproject.org New
[AUH] ttyrun: upgrading to 2.33.1 SUCCEEDED [AUH] ttyrun: upgrading to 2.33.1 SUCCEEDED - - - --- 2024-06-01 auh@yoctoproject.org New
[AUH] nasm: upgrading to 2.16.03 SUCCEEDED [AUH] nasm: upgrading to 2.16.03 SUCCEEDED - - - --- 2024-06-01 auh@yoctoproject.org New
[AUH] glib-networking: upgrading to 2.80.0 SUCCEEDED [AUH] glib-networking: upgrading to 2.80.0 SUCCEEDED - - - --- 2024-06-01 auh@yoctoproject.org New
[AUH] systemd-boot: upgrading to 255.7 SUCCEEDED [AUH] systemd-boot: upgrading to 255.7 SUCCEEDED - - - --- 2024-06-01 auh@yoctoproject.org New
[AUH] ifupdown: upgrading to 0.8.43 FAILED [AUH] ifupdown: upgrading to 0.8.43 FAILED - - - --- 2024-06-01 auh@yoctoproject.org New
[AUH] librepo: upgrading to 1.17.1 SUCCEEDED [AUH] librepo: upgrading to 1.17.1 SUCCEEDED - - - --- 2024-06-01 auh@yoctoproject.org New
[AUH] python3-dtschema: upgrading to 2024.5 SUCCEEDED [AUH] python3-dtschema: upgrading to 2024.5 SUCCEEDED - - - --- 2024-06-01 auh@yoctoproject.org New
[AUH] python3-typing-extensions: upgrading to 4.12.0 SUCCEEDED [AUH] python3-typing-extensions: upgrading to 4.12.0 SUCCEEDED - - - --- 2024-06-01 auh@yoctoproject.org New
[AUH] createrepo-c: upgrading to 1.1.2 SUCCEEDED [AUH] createrepo-c: upgrading to 1.1.2 SUCCEEDED - - - --- 2024-06-01 auh@yoctoproject.org New
[AUH] meson: upgrading to 1.4.1 SUCCEEDED [AUH] meson: upgrading to 1.4.1 SUCCEEDED - - - --- 2024-06-01 auh@yoctoproject.org New
[AUH] python3-docutils: upgrading to 0.21.2 FAILED [AUH] python3-docutils: upgrading to 0.21.2 FAILED - - - --- 2024-06-01 auh@yoctoproject.org New
[AUH] systemd: upgrading to 255.7 FAILED [AUH] systemd: upgrading to 255.7 FAILED - - - --- 2024-06-01 auh@yoctoproject.org New
[AUH] python3-trove-classifiers: upgrading to 2024.5.22 SUCCEEDED [AUH] python3-trove-classifiers: upgrading to 2024.5.22 SUCCEEDED - - - --- 2024-06-01 auh@yoctoproject.org New
[AUH] e2fsprogs: upgrading to 1.47.1 SUCCEEDED [AUH] e2fsprogs: upgrading to 1.47.1 SUCCEEDED - - - --- 2024-06-01 auh@yoctoproject.org New
[AUH] python3-hypothesis: upgrading to 6.103.0 SUCCEEDED [AUH] python3-hypothesis: upgrading to 6.103.0 SUCCEEDED - - - --- 2024-06-01 auh@yoctoproject.org New
[AUH] dhcpcd: upgrading to 10.0.8 SUCCEEDED [AUH] dhcpcd: upgrading to 10.0.8 SUCCEEDED - - - --- 2024-06-01 auh@yoctoproject.org New
[AUH] bluez5: upgrading to 5.76 FAILED [AUH] bluez5: upgrading to 5.76 FAILED - - - --- 2024-06-01 auh@yoctoproject.org New
[AUH] kea: upgrading to 2.6.0 SUCCEEDED [AUH] kea: upgrading to 2.6.0 SUCCEEDED - - - --- 2024-06-01 auh@yoctoproject.org New
[RESENDv2,2/2] insane: add patch-status to default ERROR_QA [RESENDv2,1/2] gitrepotest: add Upstream-Status to 0001-testpatch.patch - - - --- 2024-05-31 Martin Jansa New
[RESENDv2,1/2] gitrepotest: add Upstream-Status to 0001-testpatch.patch [RESENDv2,1/2] gitrepotest: add Upstream-Status to 0001-testpatch.patch - - - --- 2024-05-31 Martin Jansa New
gitrepotest: add Upstream-Status to 0001-testpatch.patch gitrepotest: add Upstream-Status to 0001-testpatch.patch - - - --- 2024-05-31 Martin Jansa New
Rust reproducibility issue summary Rust reproducibility issue summary - - - --- 2024-05-31 Richard Purdie New
[RFC,3/3] linux-yocto: update CVE product name [RFC,1/3] cve-check: enrich annotation of CVEs - - - --- 2024-05-31 Marta Rybczynska New
[RFC,2/3] vex.bbclass: add a new class [RFC,1/3] cve-check: enrich annotation of CVEs - - - --- 2024-05-31 Marta Rybczynska New
[RFC,1/3] cve-check: enrich annotation of CVEs [RFC,1/3] cve-check: enrich annotation of CVEs - - - --- 2024-05-31 Marta Rybczynska New
[3/3] mesa: add new package for Mali CSFFW Valhall firmware prepare Panthor (open-source) support for Arm GPU - - - --- 2024-05-31 Quentin Schulz New
[2/3] mesa: upgrade 24.0.7 -> 24.1.0 prepare Panthor (open-source) support for Arm GPU - - - --- 2024-05-31 Quentin Schulz New
initramfs-framework:init: fix a error message initramfs-framework:init: fix a error message - - - --- 2024-05-31 Ming Liu New
base/bitbake.conf: use default assigment for UNPACKDIR base/bitbake.conf: use default assigment for UNPACKDIR - - - --- 2024-05-31 Samuli Piippo New
Sanity: Check if tar is gnutar Sanity: Check if tar is gnutar - - - --- 2024-05-30 Simone Weiß New
[v4,2/2] image-bootfiles.bbclass: new class, copy boot files to root filesystem image-bootfiles: new class - 1 - --- 2024-05-30 Marcus Folkesson New
[v4,1/2] bootimg-partition: break out code to a common library. image-bootfiles: new class - 1 - --- 2024-05-30 Marcus Folkesson New
VOLATILE_TMP_DIR: Extend to specify the persistence of /var/tmp VOLATILE_TMP_DIR: Extend to specify the persistence of /var/tmp - - - --- 2024-05-30 Changqing Li New
systemd: fix wrong path of tmp.mount systemd: fix wrong path of tmp.mount - - - --- 2024-05-30 Changqing Li New
[kirkstone] glibc: stable 2.35 branch updates [kirkstone] glibc: stable 2.35 branch updates - - - --- 2024-05-30 Hemraj, Deepthi sakoman Under Review
kernel-yocto: fix incorrect debug message for defconfig in WORKDIR kernel-yocto: fix incorrect debug message for defconfig in WORKDIR - - - --- 2024-05-28 Quentin Schulz New
« 1 2 3 492 93 »