Toggle navigation
Patchwork
OpenEmbedded Core Layer
Patches
Bundles
About this project
Login
Register
Mail settings
Show patches with
: none
| 36440 patches
Series
Submitter
State
any
Action Required
New
Under Review
Accepted
Rejected
RFC
Not Applicable
Changes Requested
Awaiting Upstream
Superseded
Deferred
Search
Archived
No
Yes
Both
Delegate
------
Nobody
gitpwbot
gitpwbot
gitpwbot
gitpwbot
gitpwbot
gitpwbot
gitpwbot
gitpwbot
akuster
akuster
akuster
akuster
mototimo
mototimo
mototimo
kraj
kraj
denix
denix
reatmon
reatmon
rpurdie
rpurdie
rpurdie
rpurdie
sakoman
rossburton
rossburton
jonmason
abelloni
abelloni
agodard
Apply
«
1
2
...
104
105
106
…
364
365
»
Patch
Series
A/R/T
S/W/F
Date
Submitter
Delegate
State
[AUH] dtc: upgrading to 1.7.1 FAILED
[AUH] dtc: upgrading to 1.7.1 FAILED
- - -
-
-
-
2024-10-10
auh@yoctoproject.org
New
[AUH] fribidi: upgrading to 1.0.16 SUCCEEDED
[AUH] fribidi: upgrading to 1.0.16 SUCCEEDED
- - -
-
-
-
2024-10-10
auh@yoctoproject.org
New
[AUH] python3-isodate: upgrading to 0.7.2 FAILED
[AUH] python3-isodate: upgrading to 0.7.2 FAILED
- - -
-
-
-
2024-10-10
auh@yoctoproject.org
New
[AUH] tzcode-native,tzdata: upgrading to 2024b,2024b FAILED
[AUH] tzcode-native,tzdata: upgrading to 2024b,2024b FAILED
- - -
-
-
-
2024-10-10
auh@yoctoproject.org
New
[AUH] gstreamer1.0: upgrading to 1.24.8 SUCCEEDED
[AUH] gstreamer1.0: upgrading to 1.24.8 SUCCEEDED
- - -
-
-
-
2024-10-10
auh@yoctoproject.org
New
[AUH] go-binary-native: upgrading to 1.23.2 SUCCEEDED
[AUH] go-binary-native: upgrading to 1.23.2 SUCCEEDED
- - -
-
-
-
2024-10-10
auh@yoctoproject.org
New
[AUH] python3-pycryptodomex,python3-pycryptodome: upgrading to 3.21.0,3.21.0 SUCCEEDED
[AUH] python3-pycryptodomex,python3-pycryptodome: upgrading to 3.21.0,3.21.0 SUCCEEDED
- - -
-
-
-
2024-10-10
auh@yoctoproject.org
New
[AUH] python3-sphinx-rtd-theme: upgrading to 3.0.1 SUCCEEDED
[AUH] python3-sphinx-rtd-theme: upgrading to 3.0.1 SUCCEEDED
- - -
-
-
-
2024-10-10
auh@yoctoproject.org
New
[AUH] spirv-headers: upgrading to 1.3.296.0 SUCCEEDED
[AUH] spirv-headers: upgrading to 1.3.296.0 SUCCEEDED
- - -
-
-
-
2024-10-10
auh@yoctoproject.org
New
[AUH] cups: upgrading to 2.4.11 FAILED
[AUH] cups: upgrading to 2.4.11 FAILED
- - -
-
-
-
2024-10-10
auh@yoctoproject.org
New
[AUH] bash: upgrading to 5.2.37 SUCCEEDED
[AUH] bash: upgrading to 5.2.37 SUCCEEDED
- - -
-
-
-
2024-10-10
auh@yoctoproject.org
New
[AUH] python3-spdx-tools: upgrading to 0.8.3 SUCCEEDED
[AUH] python3-spdx-tools: upgrading to 0.8.3 SUCCEEDED
- - -
-
-
-
2024-10-10
auh@yoctoproject.org
New
[AUH] python3-dbusmock: upgrading to 0.32.2 SUCCEEDED
[AUH] python3-dbusmock: upgrading to 0.32.2 SUCCEEDED
- - -
-
-
-
2024-10-10
auh@yoctoproject.org
New
[AUH] fribidi: upgrading to 1.0.16 SUCCEEDED
[AUH] fribidi: upgrading to 1.0.16 SUCCEEDED
- - -
-
-
-
2024-10-10
auh@yoctoproject.org
New
[AUH] libinput: upgrading to 1.26.2 SUCCEEDED
[AUH] libinput: upgrading to 1.26.2 SUCCEEDED
- - -
-
-
-
2024-10-10
auh@yoctoproject.org
New
[AUH] vulkan-headers: upgrading to 1.3.296.0 SUCCEEDED
[AUH] vulkan-headers: upgrading to 1.3.296.0 SUCCEEDED
- - -
-
-
-
2024-10-10
auh@yoctoproject.org
New
[AUH] u-boot,u-boot-tools: upgrading to 2024.10,2024.10 FAILED
[AUH] u-boot,u-boot-tools: upgrading to 2024.10,2024.10 FAILED
- - -
-
-
-
2024-10-10
auh@yoctoproject.org
New
[AUH] python3-sphinx-rtd-theme: upgrading to 3.0.1 SUCCEEDED
[AUH] python3-sphinx-rtd-theme: upgrading to 3.0.1 SUCCEEDED
- - -
-
-
-
2024-10-10
auh@yoctoproject.org
New
[AUH] python3-spdx-tools: upgrading to 0.8.3 SUCCEEDED
[AUH] python3-spdx-tools: upgrading to 0.8.3 SUCCEEDED
- - -
-
-
-
2024-10-10
auh@yoctoproject.org
New
[AUH] gtk4: upgrading to 4.16.3 SUCCEEDED
[AUH] gtk4: upgrading to 4.16.3 SUCCEEDED
- - -
-
-
-
2024-10-10
auh@yoctoproject.org
New
[AUH] xz: upgrading to 5.6.3 SUCCEEDED
[AUH] xz: upgrading to 5.6.3 SUCCEEDED
- - -
-
-
-
2024-10-10
auh@yoctoproject.org
New
[AUH] python3-jsonschema-specifications: upgrading to 2024.10.1 SUCCEEDED
[AUH] python3-jsonschema-specifications: upgrading to 2024.10.1 SUCCEEDED
- - -
-
-
-
2024-10-10
auh@yoctoproject.org
New
[AUH] virglrenderer: upgrading to 1.1.0 FAILED
[AUH] virglrenderer: upgrading to 1.1.0 FAILED
- - -
-
-
-
2024-10-10
auh@yoctoproject.org
New
[AUH] git: upgrading to 2.47.0 SUCCEEDED
[AUH] git: upgrading to 2.47.0 SUCCEEDED
- - -
-
-
-
2024-10-10
auh@yoctoproject.org
New
[AUH] erofs-utils: upgrading to 1.8.2 SUCCEEDED
[AUH] erofs-utils: upgrading to 1.8.2 SUCCEEDED
- - -
-
-
-
2024-10-10
auh@yoctoproject.org
New
[AUH] gawk: upgrading to 5.3.1 SUCCEEDED
[AUH] gawk: upgrading to 5.3.1 SUCCEEDED
- - -
-
-
-
2024-10-10
auh@yoctoproject.org
New
[AUH] sudo: upgrading to 1.9.16 FAILED
[AUH] sudo: upgrading to 1.9.16 FAILED
- - -
-
-
-
2024-10-10
auh@yoctoproject.org
New
[AUH] python3-numpy: upgrading to 2.1.2 FAILED
[AUH] python3-numpy: upgrading to 2.1.2 FAILED
- - -
-
-
-
2024-10-10
auh@yoctoproject.org
New
[AUH] python3-cryptography: upgrading to 43.0.1 FAILED
[AUH] python3-cryptography: upgrading to 43.0.1 FAILED
- - -
-
-
-
2024-10-10
auh@yoctoproject.org
New
[AUH] weston: upgrading to 14.0.0 FAILED
[AUH] weston: upgrading to 14.0.0 FAILED
- - -
-
-
-
2024-10-10
auh@yoctoproject.org
New
[AUH] vulkan-volk: upgrading to 1.3.296.0 SUCCEEDED
[AUH] vulkan-volk: upgrading to 1.3.296.0 SUCCEEDED
- - -
-
-
-
2024-10-10
auh@yoctoproject.org
New
[AUH] xwayland: upgrading to 24.1.3 SUCCEEDED
[AUH] xwayland: upgrading to 24.1.3 SUCCEEDED
- - -
-
-
-
2024-10-10
auh@yoctoproject.org
New
[AUH] subversion: upgrading to 1.14.4 SUCCEEDED
[AUH] subversion: upgrading to 1.14.4 SUCCEEDED
- - -
-
-
-
2024-10-10
auh@yoctoproject.org
New
[AUH] python3-cryptography: upgrading to 43.0.1 FAILED
[AUH] python3-cryptography: upgrading to 43.0.1 FAILED
- - -
-
-
-
2024-10-10
auh@yoctoproject.org
New
[AUH] python3-beartype: upgrading to 0.19.0 FAILED
[AUH] python3-beartype: upgrading to 0.19.0 FAILED
- - -
-
-
-
2024-10-10
auh@yoctoproject.org
New
[AUH] dhcpcd: upgrading to 10.1.0 SUCCEEDED
[AUH] dhcpcd: upgrading to 10.1.0 SUCCEEDED
- - -
-
-
-
2024-10-10
auh@yoctoproject.org
New
[AUH] vulkan-utility-libraries: upgrading to 1.3.296.0 FAILED
[AUH] vulkan-utility-libraries: upgrading to 1.3.296.0 FAILED
- - -
-
-
-
2024-10-10
auh@yoctoproject.org
New
[AUH] msmtp: upgrading to 1.8.27 SUCCEEDED
[AUH] msmtp: upgrading to 1.8.27 SUCCEEDED
- - -
-
-
-
2024-10-10
auh@yoctoproject.org
New
[AUH] python3-setuptools: upgrading to 75.1.0 SUCCEEDED
[AUH] python3-setuptools: upgrading to 75.1.0 SUCCEEDED
- - -
-
-
-
2024-10-10
auh@yoctoproject.org
New
[AUH] git: upgrading to 2.47.0 SUCCEEDED
[AUH] git: upgrading to 2.47.0 SUCCEEDED
- - -
-
-
-
2024-10-10
auh@yoctoproject.org
New
[AUH] tzdata,tzcode-native: upgrading to 2024b,2024b FAILED
[AUH] tzdata,tzcode-native: upgrading to 2024b,2024b FAILED
- - -
-
-
-
2024-10-10
auh@yoctoproject.org
New
[AUH] cmake,cmake-native: upgrading to 3.30.5,3.30.5 SUCCEEDED
[AUH] cmake,cmake-native: upgrading to 3.30.5,3.30.5 SUCCEEDED
- - -
-
-
-
2024-10-10
auh@yoctoproject.org
New
[AUH] shaderc: upgrading to 2024.3 SUCCEEDED
[AUH] shaderc: upgrading to 2024.3 SUCCEEDED
- - -
-
-
-
2024-10-10
auh@yoctoproject.org
New
[AUH] vulkan-validation-layers: upgrading to 1.3.296.0 FAILED
[AUH] vulkan-validation-layers: upgrading to 1.3.296.0 FAILED
- - -
-
-
-
2024-10-10
auh@yoctoproject.org
New
[AUH] piglit: upgrading to de2113735cf5e3e5af7a8ec4255391b6dba5973b SUCCEEDED
[AUH] piglit: upgrading to de2113735cf5e3e5af7a8ec4255391b6dba5973b SUCCEEDED
- - -
-
-
-
2024-10-10
auh@yoctoproject.org
New
[AUH] python3-setuptools-rust: upgrading to 1.10.2 SUCCEEDED
[AUH] python3-setuptools-rust: upgrading to 1.10.2 SUCCEEDED
- - -
-
-
-
2024-10-10
auh@yoctoproject.org
New
[AUH] python3-beartype: upgrading to 0.19.0 FAILED
[AUH] python3-beartype: upgrading to 0.19.0 FAILED
- - -
-
-
-
2024-10-10
auh@yoctoproject.org
New
[AUH] gstreamer1.0-vaapi: upgrading to 1.24.8 SUCCEEDED
[AUH] gstreamer1.0-vaapi: upgrading to 1.24.8 SUCCEEDED
- - -
-
-
-
2024-10-10
auh@yoctoproject.org
New
[AUH] stress-ng: upgrading to 0.18.05 SUCCEEDED
[AUH] stress-ng: upgrading to 0.18.05 SUCCEEDED
- - -
-
-
-
2024-10-10
auh@yoctoproject.org
New
[AUH] subversion: upgrading to 1.14.4 SUCCEEDED
[AUH] subversion: upgrading to 1.14.4 SUCCEEDED
- - -
-
-
-
2024-10-10
auh@yoctoproject.org
New
[AUH] llvm: upgrading to 19.1.1 SUCCEEDED
[AUH] llvm: upgrading to 19.1.1 SUCCEEDED
- - -
-
-
-
2024-10-10
auh@yoctoproject.org
New
[AUH] ltp: upgrading to 20240930 SUCCEEDED
[AUH] ltp: upgrading to 20240930 SUCCEEDED
- - -
-
-
-
2024-10-10
auh@yoctoproject.org
New
[AUH] cmake-native,cmake: upgrading to 3.30.5,3.30.5 SUCCEEDED
[AUH] cmake-native,cmake: upgrading to 3.30.5,3.30.5 SUCCEEDED
- - -
-
-
-
2024-10-10
auh@yoctoproject.org
New
[AUH] mtd-utils: upgrading to 2.2.1 SUCCEEDED
[AUH] mtd-utils: upgrading to 2.2.1 SUCCEEDED
- - -
-
-
-
2024-10-10
auh@yoctoproject.org
New
[AUH] python3-numpy: upgrading to 2.1.2 FAILED
[AUH] python3-numpy: upgrading to 2.1.2 FAILED
- - -
-
-
-
2024-10-10
auh@yoctoproject.org
New
[AUH] vulkan-tools: upgrading to 1.3.296.0 FAILED
[AUH] vulkan-tools: upgrading to 1.3.296.0 FAILED
- - -
-
-
-
2024-10-10
auh@yoctoproject.org
New
[AUH] gstreamer1.0: upgrading to 1.24.8 SUCCEEDED
[AUH] gstreamer1.0: upgrading to 1.24.8 SUCCEEDED
- - -
-
-
-
2024-10-10
auh@yoctoproject.org
New
[AUH] wireless-regdb: upgrading to 2024.10.07 SUCCEEDED
[AUH] wireless-regdb: upgrading to 2024.10.07 SUCCEEDED
- - -
-
-
-
2024-10-10
auh@yoctoproject.org
New
[AUH] glslang: upgrading to 1.3.296.0 SUCCEEDED
[AUH] glslang: upgrading to 1.3.296.0 SUCCEEDED
- - -
-
-
-
2024-10-10
auh@yoctoproject.org
New
[AUH] ffmpeg: upgrading to 7.1 SUCCEEDED
[AUH] ffmpeg: upgrading to 7.1 SUCCEEDED
- - -
-
-
-
2024-10-10
auh@yoctoproject.org
New
[meta-oe] python3-pip: add missing RDEPENDS
[meta-oe] python3-pip: add missing RDEPENDS
- - -
-
-
-
2024-10-10
Bartosz Golaszewski
New
openssh: Be more restrictive on private key file permissions
openssh: Be more restrictive on private key file permissions
- - -
-
-
-
2024-10-10
Khem Raj
New
[kirkstone,2/2] selftest/runtime_test/virgl: Disable for all fedora
[kirkstone,1/2] valgrind: disable avx_estimate_insn.vgtest
- - -
-
-
-
2024-10-10
Steve Sakoman
sakoman
Accepted
[kirkstone,1/2] valgrind: disable avx_estimate_insn.vgtest
[kirkstone,1/2] valgrind: disable avx_estimate_insn.vgtest
- - -
-
-
-
2024-10-10
Steve Sakoman
sakoman
Accepted
[kirkstone,0/2] Patch review
- - -
-
-
-
2024-10-10
Steve Sakoman
sakoman
Not Applicable
[v3] package_rpm: Check if file exists before open()
[v3] package_rpm: Check if file exists before open()
- - -
-
-
-
2024-10-10
Pavel Zhukov
Accepted
[v2] package_rpm: Check if file exists before open()
[v2] package_rpm: Check if file exists before open()
- - -
-
-
-
2024-10-10
Pavel Zhukov
Accepted
[v2,11/11] insane: rewrite package_qa_check_arch
[v2,01/11] ffmpeg: nasm is x86 only, so only DEPEND if x86
- - -
-
-
-
2024-10-10
Ross Burton
Accepted
[v2,10/11] insane: use oe.cachedpath.CachedPath instead of os.path
[v2,01/11] ffmpeg: nasm is x86 only, so only DEPEND if x86
- - -
-
-
-
2024-10-10
Ross Burton
Accepted
[v2,09/11] insane: optimise test in package_qa_check_shebang_size
[v2,01/11] ffmpeg: nasm is x86 only, so only DEPEND if x86
- - -
-
-
-
2024-10-10
Ross Burton
Accepted
[v2,08/11] insane: micro-optimise the sweep of pkgfiles
[v2,01/11] ffmpeg: nasm is x86 only, so only DEPEND if x86
- - -
-
-
-
2024-10-10
Ross Burton
Accepted
[v2,07/11] insane: tidy up objdump preloading in package_qa_walk()
[v2,01/11] ffmpeg: nasm is x86 only, so only DEPEND if x86
- - -
-
-
-
2024-10-10
Ross Burton
Accepted
[v2,06/11] insane: check for RUNPATH as well as RPATH
[v2,01/11] ffmpeg: nasm is x86 only, so only DEPEND if x86
- - -
-
-
-
2024-10-10
Ross Burton
Accepted
[v2,05/11] insane: only parse ELFs if they're files, not symlinks
[v2,01/11] ffmpeg: nasm is x86 only, so only DEPEND if x86
- - -
-
-
-
2024-10-10
Ross Burton
Accepted
[v2,04/11] oe/elf: don't regenerate machine data on every call
[v2,01/11] ffmpeg: nasm is x86 only, so only DEPEND if x86
- - -
-
-
-
2024-10-10
Ross Burton
Accepted
[v2,03/11] libjpeg-turbo: remove redundant RUNPATH entries
[v2,01/11] ffmpeg: nasm is x86 only, so only DEPEND if x86
- - -
-
-
-
2024-10-10
Ross Burton
Accepted
[v2,02/11] ffmpeg: no need for textrel INSANE_SKIP
[v2,01/11] ffmpeg: nasm is x86 only, so only DEPEND if x86
- - -
-
-
-
2024-10-10
Ross Burton
Accepted
[v2,01/11] ffmpeg: nasm is x86 only, so only DEPEND if x86
[v2,01/11] ffmpeg: nasm is x86 only, so only DEPEND if x86
- - -
-
-
-
2024-10-10
Ross Burton
Accepted
package_rpm: Check if file exists before open()
package_rpm: Check if file exists before open()
- - -
-
-
-
2024-10-10
Pavel Zhukov
Accepted
oeqa/runtime/ssh: Rework ssh timeout
oeqa/runtime/ssh: Rework ssh timeout
- - -
-
-
-
2024-10-10
Richard Purdie
Accepted
[v2] libarchive: Update SRC_URI to use https
[v2] libarchive: Update SRC_URI to use https
- - -
-
-
-
2024-10-10
jhatnedap@gmail.com
Accepted
efi-bootdisk.wks: Increase overhead-factor to avoid test failures
efi-bootdisk.wks: Increase overhead-factor to avoid test failures
- - -
-
-
-
2024-10-10
Richard Purdie
Accepted
[v7,8/8] oeqa selftest wic.py: support UKIs via uki.bbclass
systemd uki support
- - -
-
-
-
2024-10-10
Mikko Rapeli
New
[v7,7/8] oeqa selftest wic.py: add TEST_RUNQEMUPARAMS to runqemu
systemd uki support
- - -
-
-
-
2024-10-10
Mikko Rapeli
New
[v7,6/8] oeqa selftest efibootpartition.py: remove systemd-boot from grub-efi test
systemd uki support
- - -
-
-
-
2024-10-10
Mikko Rapeli
New
[v7,5/8] oeqa selftest efibootpartition.py: add TEST_RUNQEMUPARAMS to runqemu
systemd uki support
- - -
-
-
-
2024-10-10
Mikko Rapeli
New
[v7,4/8] oeqa selftest uki.py: add tests for uki.bbclass
systemd uki support
- - -
-
-
-
2024-10-10
Mikko Rapeli
New
[v7,3/8] wic bootimg-efi.py: change UKI support from wic plugin to uki.bbclass
systemd uki support
- - -
-
-
-
2024-10-10
Mikko Rapeli
New
[v7,2/8] wic bootimg-efi.py: keep timestamps and add debug prints
systemd uki support
- - -
-
-
-
2024-10-10
Mikko Rapeli
New
[v7,1/8] uki.bbclass: add class for building Unified Kernel Images (UKI)
systemd uki support
1 - -
-
-
-
2024-10-10
Mikko Rapeli
New
[v2] bash: upgrade 5.2.32 -> 5.2.37
[v2] bash: upgrade 5.2.32 -> 5.2.37
- - -
-
-
-
2024-10-10
Wang Mingyu
Under Review
volatile-binds: mount-copybind: fix typo
volatile-binds: mount-copybind: fix typo
- - -
-
-
-
2024-10-10
Ulrich Ölmann
Accepted
[v8,7/7] oeqa/selftest/cases: add basic barebox tests
Add barebox bootloader support (and testing)
- - -
-
-
-
2024-10-10
Enrico Jörns
Accepted
[v8,6/7] oeqa/selftest/cases: add basic u-boot test
Add barebox bootloader support (and testing)
- - -
-
-
-
2024-10-10
Enrico Jörns
Accepted
[v8,5/7] oeqa: support passing custom boot patterns to runqemu
Add barebox bootloader support (and testing)
- - -
-
-
-
2024-10-10
Enrico Jörns
Accepted
[v8,4/7] oeqa/utils/qemurunner: support ignoring vt100 escape sequences
Add barebox bootloader support (and testing)
- - -
-
-
-
2024-10-10
Enrico Jörns
Accepted
[v8,3/7] barebox: set default BAREBOX_CONFIG for qemu machines
Add barebox bootloader support (and testing)
- - -
-
-
-
2024-10-10
Enrico Jörns
Accepted
[v8,2/7] barebox-tools: add initial barebox tools support
Add barebox bootloader support (and testing)
- - -
-
-
-
2024-10-10
Enrico Jörns
Accepted
[v8,1/7] barebox: add initial support
Add barebox bootloader support (and testing)
- - -
-
-
-
2024-10-10
Enrico Jörns
Accepted
archiver.bbclass: Fix archiver interaction with kernel recipes
archiver.bbclass: Fix archiver interaction with kernel recipes
- - -
-
-
-
2024-10-10
Phil Reid
New
«
1
2
...
104
105
106
…
364
365
»