Toggle navigation
Patchwork
OpenEmbedded Core Layer
Patches
Bundles
About this project
Login
Register
Mail settings
Show patches with
: Archived =
No
| 17148 patches
Series
Submitter
State
any
Action Required
New
Under Review
Accepted
Rejected
RFC
Not Applicable
Changes Requested
Awaiting Upstream
Superseded
Deferred
Search
Archived
No
Yes
Both
Delegate
------
Nobody
gitpwbot
gitpwbot
gitpwbot
gitpwbot
gitpwbot
gitpwbot
gitpwbot
gitpwbot
mototimo
mototimo
mototimo
kraj
kraj
denix
denix
reatmon
reatmon
rpurdie
rpurdie
rpurdie
rpurdie
sakoman
ycongal_smile
ycongal_smile
ycongal_smile
rossburton
rossburton
jonmason
abelloni
abelloni
agodard
mathieu
anujm
fatho
fatho
fatho
boucman
boucman
boucman
Apply
«
1
2
3
4
…
171
172
»
Patch
Series
A/R/T
S/W/F
Date
Submitter
Delegate
State
compiler-rt: Use specific arm architecture instead of 'arm'
compiler-rt: Use specific arm architecture instead of 'arm'
- - -
-
-
-
2026-09-25
Jan Strater-Büddefeld
New
[2/2] python3-dtschema-wrapper: remove obsolete recipe
[1/2] linux-yocto-dev: drop DeviceTree validation dependencies
1 - -
-
-
-
2026-09-25
Ross Burton
New
[1/2] linux-yocto-dev: drop DeviceTree validation dependencies
[1/2] linux-yocto-dev: drop DeviceTree validation dependencies
- - -
-
-
-
2026-09-25
Ross Burton
New
gcr: remove now-redundant gnome_verdir() replacement
gcr: remove now-redundant gnome_verdir() replacement
- - -
-
-
-
2026-09-25
Ross Burton
New
[v2] gstreamer: skip test_queue:test_leaky_downstream test as it's flakey
[v2] gstreamer: skip test_queue:test_leaky_downstream test as it's flakey
- - -
-
-
-
2026-09-25
Ross Burton
New
wget: fix CVE-2026-15146
wget: fix CVE-2026-15146
- - -
-
-
-
2026-09-25
Ghanshyam Banait
New
clang/llvm: Upgrade to 23.1.2 release
clang/llvm: Upgrade to 23.1.2 release
- - -
-
-
-
2026-09-25
Varatharajan, Deepesh
New
gstreamer: skip test_queue:test_leaky_downstream test as it's flakey
gstreamer: skip test_queue:test_leaky_downstream test as it's flakey
- - -
-
-
-
2026-09-25
Ross Burton
New
[v2,2/2] scripts/contrib: add spdx-release-date-report.py
[v2,1/2] create-spdx-3.0: record component release date in SPDX output
- - -
-
-
-
2026-09-25
Daniel Turull
New
[v2,1/2] create-spdx-3.0: record component release date in SPDX output
[v2,1/2] create-spdx-3.0: record component release date in SPDX output
- - -
-
-
-
2026-09-25
Daniel Turull
New
rt-tests/hwlatdetect: upgrade 2.10 -> 2.11
rt-tests/hwlatdetect: upgrade 2.10 -> 2.11
- - -
-
-
-
2026-09-25
Jaipaul Cheernam
New
[1/2] rt-tests: drop Makefile CC/AR patch and use EXTRA_OEMAKE
[1/2] rt-tests: drop Makefile CC/AR patch and use EXTRA_OEMAKE
- - -
-
-
-
2026-09-25
Jaipaul Cheernam
New
[v3] tiff: add ptest support
[v3] tiff: add ptest support
- - -
-
-
-
2026-09-25
Himani Ramesh Barde
New
[AUH] parted: upgrading to 3.8 SUCCEEDED
[AUH] parted: upgrading to 3.8 SUCCEEDED
- - -
-
-
-
2026-09-25
auh@yoctoproject.org
New
[AUH] epiphany: upgrading to 51.1 SUCCEEDED
[AUH] epiphany: upgrading to 51.1 SUCCEEDED
- - -
-
-
-
2026-09-25
auh@yoctoproject.org
New
[AUH] libuv: upgrading to 1.53.0 SUCCEEDED
[AUH] libuv: upgrading to 1.53.0 SUCCEEDED
- - -
-
-
-
2026-09-25
auh@yoctoproject.org
New
[AUH] libpam: upgrading to 1.7.3 SUCCEEDED
[AUH] libpam: upgrading to 1.7.3 SUCCEEDED
- - -
-
-
-
2026-09-25
auh@yoctoproject.org
New
[AUH] python3-uv-build: upgrading to 0.12.19 SUCCEEDED
[AUH] python3-uv-build: upgrading to 0.12.19 SUCCEEDED
- - -
-
-
-
2026-09-25
auh@yoctoproject.org
New
libx11: stage the X11 locale data in the native sysroot
libx11: stage the X11 locale data in the native sysroot
- - -
-
-
-
2026-09-25
Markus Volk
New
go: skip internal/cgrouptest when cpu.max is not available
go: skip internal/cgrouptest when cpu.max is not available
- - -
-
-
-
2026-09-25
Khem Raj
New
go: skip internal/cgrouptest when cpu.max is not available
go: skip internal/cgrouptest when cpu.max is not available
- - -
-
-
-
2026-09-25
Khem Raj
New
xxhash: inherit lib_package
xxhash: inherit lib_package
- - -
-
-
-
2026-09-24
Ross Burton
New
[4/4] dwarfsrcfiles: remove
[1/4] lib/oe/package: remove unused and optional fatal argument to source_info()
- - -
-
-
-
2026-09-24
Ross Burton
New
[3/4] classes/package: use eu-srcfiles instead of dwarfsrcfiles
[1/4] lib/oe/package: remove unused and optional fatal argument to source_info()
- - -
-
-
-
2026-09-24
Ross Burton
New
[2/4] elfutils: fix handling of DWARF5 compilation units
[1/4] lib/oe/package: remove unused and optional fatal argument to source_info()
- - -
-
-
-
2026-09-24
Ross Burton
New
[1/4] lib/oe/package: remove unused and optional fatal argument to source_info()
[1/4] lib/oe/package: remove unused and optional fatal argument to source_info()
- - -
-
-
-
2026-09-24
Ross Burton
New
[v4] systemd: backport fix for limits.h override
[v4] systemd: backport fix for limits.h override
- - -
-
-
-
2026-09-24
Jaipaul Cheernam
New
[scarthgap,v2,2/2] python3-pyasn1: fix CVE-2026-59885
[OE-core[scarthgap,v2,1/2] python3-pyasn1: fix CVE-2026-30922
- - -
-
-
-
2026-09-24
Yogita Urade
ycongal_smile
New
[OE-core[scarthgap,v2,1/2] python3-pyasn1: fix CVE-2026-30922
[OE-core[scarthgap,v2,1/2] python3-pyasn1: fix CVE-2026-30922
- - -
-
-
-
2026-09-24
Yogita Urade
New
python3: ptest: skip flaky test_staggered_race_with_eager_tasks
python3: ptest: skip flaky test_staggered_race_with_eager_tasks
- - -
-
-
-
2026-09-24
Pratik Farkase
New
go-mod-update-modules: Combine env with fetcher environment
go-mod-update-modules: Combine env with fetcher environment
- - -
-
-
-
2026-09-24
Michal Sieron
New
[v3] systemd: fix musl build by fixing limits.h override
[v3] systemd: fix musl build by fixing limits.h override
- - -
-
-
-
2026-09-24
Ross Burton
New
[scarthgap,v2] glibc: Fix CVE-2026-6238
[scarthgap,v2] glibc: Fix CVE-2026-6238
- - -
-
-
-
2026-09-24
Varatharajan, Deepesh
ycongal_smile
New
[v2] kernel-fit-image: remove fatal error when .crt file is missing
[v2] kernel-fit-image: remove fatal error when .crt file is missing
- - -
-
-
-
2026-09-24
Tobias Pistora
New
remove fatal error when .crt file is missing at fitimage sanity check
remove fatal error when .crt file is missing at fitimage sanity check
- - -
-
-
-
2026-09-24
Tobias Pistora
New
barebox: install generated dtbs
barebox: install generated dtbs
- - -
-
-
-
2026-09-24
Fabian Pfitzner
New
[2/2] devtool: ide-sdk: allow ide plugins to add packages rootfs-dbg
[1/2] devtool: ide-sdk: make nfs export script quicker
- - -
-
-
-
2026-09-24
Freihofer, Adrian
New
[1/2] devtool: ide-sdk: make nfs export script quicker
[1/2] devtool: ide-sdk: make nfs export script quicker
- - -
-
-
-
2026-09-24
Freihofer, Adrian
New
[AUH] repo: upgrading to 2.68.1 SUCCEEDED
[AUH] repo: upgrading to 2.68.1 SUCCEEDED
- - -
-
-
-
2026-09-24
auh@yoctoproject.org
New
[AUH] gnupg: upgrading to 2.5.24 SUCCEEDED
[AUH] gnupg: upgrading to 2.5.24 SUCCEEDED
- - -
-
-
-
2026-09-24
auh@yoctoproject.org
New
[AUH] python3-vcs-versioning: upgrading to 2.5.0 SUCCEEDED
[AUH] python3-vcs-versioning: upgrading to 2.5.0 SUCCEEDED
- - -
-
-
-
2026-09-24
auh@yoctoproject.org
New
[AUH] python3-wcwidth: upgrading to 0.9.1 SUCCEEDED
[AUH] python3-wcwidth: upgrading to 0.9.1 SUCCEEDED
- - -
-
-
-
2026-09-24
auh@yoctoproject.org
New
[AUH] shadow: upgrading to 4.20.3 FAILED
[AUH] shadow: upgrading to 4.20.3 FAILED
- - -
-
-
-
2026-09-24
auh@yoctoproject.org
New
[AUH] python3-setuptools-scm: upgrading to 10.3.4 FAILED
[AUH] python3-setuptools-scm: upgrading to 10.3.4 FAILED
- - -
-
-
-
2026-09-24
auh@yoctoproject.org
New
[AUH] python3-pytz: upgrading to 2026.4 SUCCEEDED
[AUH] python3-pytz: upgrading to 2026.4 SUCCEEDED
- - -
-
-
-
2026-09-24
auh@yoctoproject.org
New
[v2,3/3] oe/package.py: copydebugsources: add all kernel source files
Fix kernel complementary package installation
- - -
-
-
-
2026-09-23
Freihofer, Adrian
New
[v2,2/3] core-image.bbclass: do not pull the kernel -src package in via complementary packages
Fix kernel complementary package installation
- - -
-
-
-
2026-09-23
Freihofer, Adrian
New
[v2,1/3] kernel.bbclass: make the -src package installable on purpose
Fix kernel complementary package installation
- - -
-
-
-
2026-09-23
Freihofer, Adrian
New
[13/13] selftest: resulttooltests.py: add min-duration default test
resulttool: add 'durations' subcommand and selftests
- - -
-
-
-
2026-09-23
Trevor Gamblin
New
[12/13] selftest: resulttooltests.py: add short-tables ordering test
resulttool: add 'durations' subcommand and selftests
- - -
-
-
-
2026-09-23
Trevor Gamblin
New
[11/13] selftest: resulttooltests.py: add limit-after-sort test
resulttool: add 'durations' subcommand and selftests
- - -
-
-
-
2026-09-23
Trevor Gamblin
New
[10/13] selftest: resulttooltests.py: add sort-by-delta test
resulttool: add 'durations' subcommand and selftests
- - -
-
-
-
2026-09-23
Trevor Gamblin
New
[09/13] selftest: resulttooltests.py: add None-pct threshold test
resulttool: add 'durations' subcommand and selftests
- - -
-
-
-
2026-09-23
Trevor Gamblin
New
[08/13] selftest: resulttooltests.py: add multi-pair threshold test
resulttool: add 'durations' subcommand and selftests
- - -
-
-
-
2026-09-23
Trevor Gamblin
New
[07/13] selftest: resulttooltests.py: add threshold-disabled test
resulttool: add 'durations' subcommand and selftests
- - -
-
-
-
2026-09-23
Trevor Gamblin
New
[06/13] selftest: resulttooltests.py: add threshold filtering test
resulttool: add 'durations' subcommand and selftests
- - -
-
-
-
2026-09-23
Trevor Gamblin
New
[05/13] selftest: resulttooltests.py: add consecutive-pair delta test
resulttool: add 'durations' subcommand and selftests
- - -
-
-
-
2026-09-23
Trevor Gamblin
New
[04/13] selftest: resulttooltests.py: add zero-round pct suppression test
resulttool: add 'durations' subcommand and selftests
- - -
-
-
-
2026-09-23
Trevor Gamblin
New
[03/13] selftest: resulttooltests.py: add report-log Time(s) column test
resulttool: add 'durations' subcommand and selftests
- - -
-
-
-
2026-09-23
Trevor Gamblin
New
[02/13] selftest: resulttooltests.py: add basic durations test
resulttool: add 'durations' subcommand and selftests
- - -
-
-
-
2026-09-23
Trevor Gamblin
New
[01/13] scripts: resulttool: add 'durations' option
resulttool: add 'durations' subcommand and selftests
- - -
-
-
-
2026-09-23
Trevor Gamblin
New
[scarthgap] u-boot-tools: use all patches from u-boot
[scarthgap] u-boot-tools: use all patches from u-boot
- - -
-
-
-
2026-09-23
Marko, Peter
ycongal_smile
New
coreutils: Upgrade 9.11 -> 9.12
coreutils: Upgrade 9.11 -> 9.12
- - -
-
-
-
2026-09-23
Leon Anavi
New
[scarthgap] systemd: backport networkd route readiness fix from upstream
[scarthgap] systemd: backport networkd route readiness fix from upstream
- - -
-
-
-
2026-09-23
Akash Hadke
ycongal_smile
New
[scarthgap,v2] python3-click: fix CVE-2026-7246
[scarthgap,v2] python3-click: fix CVE-2026-7246
- - -
-
-
-
2026-09-23
Darsh Kelaiya -X (dkelaiya - E INFOCHIPS PRIVATE LIMITED at Cisco)
ycongal_smile
New
[AUH] gpgme: upgrading to 2.2.0 SUCCEEDED
[AUH] gpgme: upgrading to 2.2.0 SUCCEEDED
- - -
-
-
-
2026-09-23
auh@yoctoproject.org
New
[AUH] python3-mako: upgrading to 1.4.3 SUCCEEDED
[AUH] python3-mako: upgrading to 1.4.3 SUCCEEDED
- - -
-
-
-
2026-09-23
auh@yoctoproject.org
New
[AUH] gnupg: upgrading to 2.5.23 SUCCEEDED
[AUH] gnupg: upgrading to 2.5.23 SUCCEEDED
- - -
-
-
-
2026-09-23
auh@yoctoproject.org
New
[AUH] python3-uv-build: upgrading to 0.12.18 SUCCEEDED
[AUH] python3-uv-build: upgrading to 0.12.18 SUCCEEDED
- - -
-
-
-
2026-09-23
auh@yoctoproject.org
New
[AUH] python3-pdm-backend: upgrading to 2.4.10 SUCCEEDED
[AUH] python3-pdm-backend: upgrading to 2.4.10 SUCCEEDED
- - -
-
-
-
2026-09-23
auh@yoctoproject.org
New
[AUH] python3-hypothesis: upgrading to 6.168.1 SUCCEEDED
[AUH] python3-hypothesis: upgrading to 6.168.1 SUCCEEDED
- - -
-
-
-
2026-09-23
auh@yoctoproject.org
New
[AUH] python3-cython: upgrading to 3.3.0 SUCCEEDED
[AUH] python3-cython: upgrading to 3.3.0 SUCCEEDED
- - -
-
-
-
2026-09-23
auh@yoctoproject.org
New
[AUH] meson: upgrading to 1.12.1 SUCCEEDED
[AUH] meson: upgrading to 1.12.1 SUCCEEDED
- - -
-
-
-
2026-09-23
auh@yoctoproject.org
New
[AUH] libslirp: upgrading to 4.9.5 SUCCEEDED
[AUH] libslirp: upgrading to 4.9.5 SUCCEEDED
- - -
-
-
-
2026-09-23
auh@yoctoproject.org
New
[AUH] expat: upgrading to 2.8.5 SUCCEEDED
[AUH] expat: upgrading to 2.8.5 SUCCEEDED
- - -
-
-
-
2026-09-23
auh@yoctoproject.org
New
initramfs-framework: retry LABEL lookup before coldplug fallback
initramfs-framework: retry LABEL lookup before coldplug fallback
- - -
-
-
-
2026-09-23
Wenwen Fu
New
[scarthgap] vim: fix backport format for CVE-2026-73076
[scarthgap] vim: fix backport format for CVE-2026-73076
- - -
-
-
-
2026-09-23
Hitendra Prajapati
ycongal_smile
New
create-spdx-3.0: record component release date in SPDX output
create-spdx-3.0: record component release date in SPDX output
- - -
-
-
-
2026-09-22
Daniel Turull
New
[wrynose] cpio: fix "CVE:" marker in CVE-2026-66484.patch
[wrynose] cpio: fix "CVE:" marker in CVE-2026-66484.patch
- - -
-
-
-
2026-09-22
Yoann Congal
ycongal_smile
Under Review
[5/5] go-mod-update-modules: include the generated files from the class
[1/5] gcr: initialize libgcrypt from the secret exchange
- - -
-
-
-
2026-09-22
Markus Volk
New
[4/5] license_finder: normalise license texts before hashing
[1/5] gcr: initialize libgcrypt from the secret exchange
- - -
-
-
-
2026-09-22
Markus Volk
New
[3/5] spdx_license: give UnknownId a name
[1/5] gcr: initialize libgcrypt from the secret exchange
- - -
-
-
-
2026-09-22
Markus Volk
New
[2/5] cpan: survive the Makefile that MakeMaker rebuilds under us
[1/5] gcr: initialize libgcrypt from the secret exchange
- - -
-
-
-
2026-09-22
Markus Volk
New
[1/5] gcr: initialize libgcrypt from the secret exchange
[1/5] gcr: initialize libgcrypt from the secret exchange
- - -
-
-
-
2026-09-22
Markus Volk
New
externalsrc: fix PKGV for devtool build
externalsrc: fix PKGV for devtool build
- - -
-
-
-
2026-09-22
Paddy Chiu
New
[scarthgap,v2,3/3] python3-cryptography: Fix CVE-2026-69249
[scarthgap,v2,1/3] python3-cryptography: Fix CVE-2026-34073
- - -
-
-
-
2026-09-22
Vijay Anusuri
ycongal_smile
Under Review
[scarthgap,v2,2/3] python3-cryptography: Fix CVE-2026-69248
[scarthgap,v2,1/3] python3-cryptography: Fix CVE-2026-34073
- - -
-
-
-
2026-09-22
Vijay Anusuri
ycongal_smile
Under Review
[scarthgap,v2,1/3] python3-cryptography: Fix CVE-2026-34073
[scarthgap,v2,1/3] python3-cryptography: Fix CVE-2026-34073
- - -
-
-
-
2026-09-22
Vijay Anusuri
ycongal_smile
Under Review
[wrynose,5/5] ffmpeg: Fix for CVE-2026-66041
[wrynose,1/5] ffmpeg: Fix for CVE-2026-66036
- - -
-
-
-
2026-09-22
Bhavesh Rajesh Maheshwari
ycongal_smile
Under Review
[wrynose,4/5] ffmpeg: Fix for CVE-2026-66039
[wrynose,1/5] ffmpeg: Fix for CVE-2026-66036
- - -
-
-
-
2026-09-22
Bhavesh Rajesh Maheshwari
ycongal_smile
Under Review
[wrynose,3/5] ffmpeg: Fix for CVE-2026-66038
[wrynose,1/5] ffmpeg: Fix for CVE-2026-66036
- - -
-
-
-
2026-09-22
Bhavesh Rajesh Maheshwari
ycongal_smile
Under Review
[wrynose,2/5] ffmpeg: Fix for CVE-2026-66037
[wrynose,1/5] ffmpeg: Fix for CVE-2026-66036
- - -
-
-
-
2026-09-22
Bhavesh Rajesh Maheshwari
ycongal_smile
Under Review
[wrynose,1/5] ffmpeg: Fix for CVE-2026-66036
[wrynose,1/5] ffmpeg: Fix for CVE-2026-66036
- - -
-
-
-
2026-09-22
Bhavesh Rajesh Maheshwari
ycongal_smile
Under Review
[wrynose] bitbake.conf: pseudo add rootfs-dbg to PSEUDO_INCLUDE_PATHS
[wrynose] bitbake.conf: pseudo add rootfs-dbg to PSEUDO_INCLUDE_PATHS
- - -
-
-
-
2026-09-22
Marko, Peter
ycongal_smile
Under Review
[wrynose] qemu: fix CVE-2026-48914
[wrynose] qemu: fix CVE-2026-48914
- - -
-
-
-
2026-09-22
Roopa Kalmath
ycongal_smile
Under Review
[AUH] repo: upgrading to 2.68 SUCCEEDED
[AUH] repo: upgrading to 2.68 SUCCEEDED
- - -
-
-
-
2026-09-22
auh@yoctoproject.org
New
[AUH] libsolv: upgrading to 0.7.40 SUCCEEDED
[AUH] libsolv: upgrading to 0.7.40 SUCCEEDED
- - -
-
-
-
2026-09-22
auh@yoctoproject.org
New
[AUH] diffoscope: upgrading to 330 SUCCEEDED
[AUH] diffoscope: upgrading to 330 SUCCEEDED
- - -
-
-
-
2026-09-22
auh@yoctoproject.org
New
[AUH] python3-trove-classifiers: upgrading to 2026.9.21.13 SUCCEEDED
[AUH] python3-trove-classifiers: upgrading to 2026.9.21.13 SUCCEEDED
- - -
-
-
-
2026-09-22
auh@yoctoproject.org
New
[AUH] ttyrun: upgrading to 2.44.1 SUCCEEDED
[AUH] ttyrun: upgrading to 2.44.1 SUCCEEDED
- - -
-
-
-
2026-09-22
auh@yoctoproject.org
New
«
1
2
3
4
…
171
172
»