Toggle navigation
Patchwork
OpenEmbedded Core Layer
Patches
Bundles
About this project
Login
Register
Mail settings
Show patches with
: State =
Action Required
| Archived =
No
| 15774 patches
Series
Submitter
State
any
Action Required
New
Under Review
Accepted
Rejected
RFC
Not Applicable
Changes Requested
Awaiting Upstream
Superseded
Deferred
Search
Archived
No
Yes
Both
Delegate
------
Nobody
gitpwbot
gitpwbot
gitpwbot
gitpwbot
gitpwbot
gitpwbot
gitpwbot
gitpwbot
mototimo
mototimo
mototimo
kraj
kraj
denix
denix
reatmon
reatmon
rpurdie
rpurdie
rpurdie
rpurdie
sakoman
ycongal_smile
ycongal_smile
ycongal_smile
rossburton
rossburton
jonmason
abelloni
abelloni
agodard
mathieu
trukna
anujm
fatho
fatho
fatho
boucman
boucman
boucman
Apply
«
1
2
3
4
…
157
158
»
Patch
Series
A/R/T
S/W/F
Date
Submitter
Delegate
State
[v3,2/2] python3: Upgrade 3.14.10 -> 3.15.2
python3 upgrade to 3.15.2
- - -
-
-
-
2026-10-29
Jaipaul Cheernam
New
[v3,1/2] python3-maturin: Add support for python 3.15.2
python3 upgrade to 3.15.2
- - -
-
-
-
2026-10-29
Jaipaul Cheernam
New
[v2] kernel.bbclass: add gzip-native to DEPENDS
[v2] kernel.bbclass: add gzip-native to DEPENDS
1 - -
-
-
-
2026-10-29
Vinicius Pedrosa
New
lrzsz: disable Werror (fix clang 23 build)
lrzsz: disable Werror (fix clang 23 build)
- - -
-
-
-
2026-10-29
Jeroen Hofstee
New
[wrynose,4/4] bind: upgrade 9.20.29 -> 9.20.30
[wrynose,1/4] python3: upgrade 3.14.7 -> 3.14.9
- - -
-
-
-
2026-10-29
Peter Marko
New
[wrynose,3/4] systemd: add iproute2-devlink runtime dependency to udev
[wrynose,1/4] python3: upgrade 3.14.7 -> 3.14.9
- - -
-
-
-
2026-10-29
Peter Marko
New
[wrynose,2/4] python3: upgrade 3.14.9 -> 3.14.10
[wrynose,1/4] python3: upgrade 3.14.7 -> 3.14.9
- - -
-
-
-
2026-10-29
Peter Marko
New
[wrynose,1/4] python3: upgrade 3.14.7 -> 3.14.9
[wrynose,1/4] python3: upgrade 3.14.7 -> 3.14.9
- - -
-
-
-
2026-10-29
Peter Marko
New
[blacksail,8/8] libical: upgrade 4.0.6 -> 4.0.7
[blacksail,1/8] python3: upgrade 3.14.7 -> 3.14.9
- - -
-
-
-
2026-10-29
Peter Marko
New
[blacksail,7/8] libical: uprade 4.0.5 -> 4.0.6
[blacksail,1/8] python3: upgrade 3.14.7 -> 3.14.9
- - -
-
-
-
2026-10-29
Peter Marko
New
[blacksail,6/8] cups: upgrade 2.4.19 -> 2.4.20
[blacksail,1/8] python3: upgrade 3.14.7 -> 3.14.9
- - -
-
-
-
2026-10-29
Peter Marko
New
[blacksail,5/8] bison: Fix CVE-2026-56390
[blacksail,1/8] python3: upgrade 3.14.7 -> 3.14.9
- - -
-
-
-
2026-10-29
Peter Marko
New
[blacksail,4/8] bind: upgrade 9.20.29 -> 9.20.30
[blacksail,1/8] python3: upgrade 3.14.7 -> 3.14.9
- - -
-
-
-
2026-10-29
Peter Marko
New
[blacksail,3/8] systemd: add iproute2-devlink runtime dependency to udev
[blacksail,1/8] python3: upgrade 3.14.7 -> 3.14.9
- - -
-
-
-
2026-10-29
Peter Marko
New
[blacksail,2/8] python3: upgrade 3.14.9 -> 3.14.10
[blacksail,1/8] python3: upgrade 3.14.7 -> 3.14.9
- - -
-
-
-
2026-10-29
Peter Marko
New
[blacksail,1/8] python3: upgrade 3.14.7 -> 3.14.9
[blacksail,1/8] python3: upgrade 3.14.7 -> 3.14.9
- - -
-
-
-
2026-10-29
Peter Marko
New
[scarthgap,2/2] openssh: fix CVE-2026-106553
openssh: fix GSSAPI CVE-2026-106555 and CVE-2026-106553
- - -
-
-
-
2026-10-29
Benhur Tessele
New
[scarthgap,1/2] openssh: fix CVE-2026-106555
openssh: fix GSSAPI CVE-2026-106555 and CVE-2026-106553
- - -
-
-
-
2026-10-29
Benhur Tessele
New
pseudo: Tell makewrappers the target architecture
pseudo: Tell makewrappers the target architecture
- - -
-
-
-
2026-10-29
Dora, Sunil Kumar
New
lttng-ust: add ptest support
lttng-ust: add ptest support
- - -
-
-
-
2026-10-29
Pratik Farkase
New
kernel.bbclass: add gzip-native to DEPENDS
kernel.bbclass: add gzip-native to DEPENDS
- - -
-
-
-
2026-10-29
Vinicius Pedrosa
New
[v2] uki.bbclass: drop stray f-string prefix in kernel-not-found error
[v2] uki.bbclass: drop stray f-string prefix in kernel-not-found error
- - -
-
-
-
2026-10-29
Maxin John
Under Review
[RFC,4/4] multilib_header: wrap musl headers for multilib builds
musl multilib: loader path and headers
- - -
-
-
-
2026-10-29
mark.yang
New
[RFC,3/4] multilib_header_wrapper.h: support musl
musl multilib: loader path and headers
- - -
-
-
-
2026-10-29
mark.yang
New
[RFC,2/4] musl: wrap the bits headers for multilib
musl multilib: loader path and headers
- - -
-
-
-
2026-10-29
mark.yang
New
[RFC,1/4] gcc: point the musl dynamic linker at nonarch_base_libdir
musl multilib: loader path and headers
- - -
-
-
-
2026-10-29
mark.yang
New
yocto-check-layer: don't skip entries when dropping invalid layers
yocto-check-layer: don't skip entries when dropping invalid layers
- - -
-
-
-
2026-10-29
Vinicius Pedrosa
Under Review
[wrynose,v2,3/3] lrzsz: fix CVE-2026-105842
[wrynose,v2,1/3] lrzsz: fix CVE-2026-105841
- - -
-
-
-
2026-10-29
Hetvi Thakar -X (hthakar - E INFOCHIPS PRIVATE LIMITED at Cisco)
New
[wrynose,v2,2/3] lrzsz: fix CVE-2026-105840
[wrynose,v2,1/3] lrzsz: fix CVE-2026-105841
- - -
-
-
-
2026-10-29
Hetvi Thakar -X (hthakar - E INFOCHIPS PRIVATE LIMITED at Cisco)
New
[wrynose,v2,1/3] lrzsz: fix CVE-2026-105841
[wrynose,v2,1/3] lrzsz: fix CVE-2026-105841
- - -
-
-
-
2026-10-29
Hetvi Thakar -X (hthakar - E INFOCHIPS PRIVATE LIMITED at Cisco)
New
[v2,2/2] python3-pytest: upgrade 9.1.1 -> 9.2.0
[v2,1/2] python3-unittest-automake-output: fix pytest 9.2.0 trylast deprecation
- - -
-
-
-
2026-10-29
Jaipaul Cheernam
Under Review
[v2,1/2] python3-unittest-automake-output: fix pytest 9.2.0 trylast deprecation
[v2,1/2] python3-unittest-automake-output: fix pytest 9.2.0 trylast deprecation
- - -
-
-
-
2026-10-29
Jaipaul Cheernam
Under Review
[scarthgap,v4,5/5] apr-util: Fix CVE-2026-34502
[scarthgap,v4,1/5] apr-util: Fix CVE-2025-49506
- - -
-
-
-
2026-10-29
Hetvi Thakar -X (hthakar - E INFOCHIPS PRIVATE LIMITED at Cisco)
ycongal_smile
Under Review
[scarthgap,v4,4/5] apr-util: Fix CVE-2026-34501
[scarthgap,v4,1/5] apr-util: Fix CVE-2025-49506
- - -
-
-
-
2026-10-29
Hetvi Thakar -X (hthakar - E INFOCHIPS PRIVATE LIMITED at Cisco)
ycongal_smile
Under Review
[scarthgap,v4,3/5] apr-util: Mark CVE-2026-34191 not applicable
[scarthgap,v4,1/5] apr-util: Fix CVE-2025-49506
- - -
-
-
-
2026-10-29
Hetvi Thakar -X (hthakar - E INFOCHIPS PRIVATE LIMITED at Cisco)
ycongal_smile
Under Review
[scarthgap,v4,2/5] apr-util: Fix CVE-2026-32327
[scarthgap,v4,1/5] apr-util: Fix CVE-2025-49506
- - -
-
-
-
2026-10-29
Hetvi Thakar -X (hthakar - E INFOCHIPS PRIVATE LIMITED at Cisco)
ycongal_smile
Under Review
[scarthgap,v4,1/5] apr-util: Fix CVE-2025-49506
[scarthgap,v4,1/5] apr-util: Fix CVE-2025-49506
- - -
-
-
-
2026-10-29
Hetvi Thakar -X (hthakar - E INFOCHIPS PRIVATE LIMITED at Cisco)
ycongal_smile
Under Review
[v2] maintainers.inc: add RECIPE_UPGRADE_CHANGELOG_SKIP
[v2] maintainers.inc: add RECIPE_UPGRADE_CHANGELOG_SKIP
- - -
-
-
-
2026-10-29
Daniel Turull
Under Review
[v5] igt-gpu-tools: fix build on non-x86 platforms
[v5] igt-gpu-tools: fix build on non-x86 platforms
- - -
-
-
-
2026-10-29
Jose Quaresma
Under Review
[v4] igt-gpu-tools: fix build on non-x86 platforms
[v4] igt-gpu-tools: fix build on non-x86 platforms
- - -
-
-
-
2026-10-29
Jose Quaresma
New
spdx30_tasks: include the SDK target packages in the SDK SBOM
spdx30_tasks: include the SDK target packages in the SDK SBOM
- - -
-
-
-
2026-10-29
Prasanth R
Under Review
[4/4] cracklib: upgrade 2.10.3 -> 2.10.4
[1/4] tzdata/tzcode-native: upgrade 2026e -> 2026f
- - -
-
-
-
2026-10-29
Ankur Tyagi
Under Review
[3/4] glib-networking: upgrade 2.90.0 -> 2.90.1
[1/4] tzdata/tzcode-native: upgrade 2026e -> 2026f
- - -
-
-
-
2026-10-29
Ankur Tyagi
Under Review
[2/4] aspell: upgrade 0.60.8.2 -> 0.60.8.3
[1/4] tzdata/tzcode-native: upgrade 2026e -> 2026f
- - -
-
-
-
2026-10-29
Ankur Tyagi
Under Review
[1/4] tzdata/tzcode-native: upgrade 2026e -> 2026f
[1/4] tzdata/tzcode-native: upgrade 2026e -> 2026f
- - -
-
-
-
2026-10-29
Ankur Tyagi
Under Review
[v3,3/3] openssl: Upgrade 4.0.3 -> 4.1.0
openssl: Upgrade 4.0.3 -> 4.1.0 and dependencies update
- - -
-
-
-
2026-10-29
Jaipaul Cheernam
Under Review
[v3,2/3] python3-pyopenssl: Add patch to return None for TLS 1.3
openssl: Upgrade 4.0.3 -> 4.1.0 and dependencies update
- - -
-
-
-
2026-10-29
Jaipaul Cheernam
Under Review
[v3,1/3] python3-cryptography: backport InvalidTag fix for openssl 4.1.0
openssl: Upgrade 4.0.3 -> 4.1.0 and dependencies update
- - -
-
-
-
2026-10-29
Jaipaul Cheernam
Under Review
[scarthgap,PATCHv5] vim: Fix for CVE-2026-73076
[scarthgap,PATCHv5] vim: Fix for CVE-2026-73076
- - -
-
-
-
2026-10-29
Hitendra Prajapati
ycongal_smile
Under Review
kernel-grub.bbclass: use KERNEL_PACKAGE_NAME for the image packages
kernel-grub.bbclass: use KERNEL_PACKAGE_NAME for the image packages
1 - -
-
-
-
2026-10-29
Prasanth R
New
[v2] kernel.bbclass: fix -dev files when KERNEL_PACKAGE_NAME is PN
[v2] kernel.bbclass: fix -dev files when KERNEL_PACKAGE_NAME is PN
1 - -
-
-
-
2026-10-29
Prasanth R
New
[AUH] appstream: upgrading to 1.2.2 SUCCEEDED
[AUH] appstream: upgrading to 1.2.2 SUCCEEDED
- - -
-
-
-
2026-10-29
auh@yoctoproject.org
New
[AUH] python3-hypothesis: upgrading to 6.170.13 SUCCEEDED
[AUH] python3-hypothesis: upgrading to 6.170.13 SUCCEEDED
- - -
-
-
-
2026-10-29
auh@yoctoproject.org
New
[AUH] dbus-glib: upgrading to 0.116 SUCCEEDED
[AUH] dbus-glib: upgrading to 0.116 SUCCEEDED
- - -
-
-
-
2026-10-29
auh@yoctoproject.org
New
[AUH] cracklib: upgrading to 2.10.4 FAILED
[AUH] cracklib: upgrading to 2.10.4 FAILED
- - -
-
-
-
2026-10-29
auh@yoctoproject.org
New
[AUH] aspell: upgrading to 0.60.8.3 SUCCEEDED
[AUH] aspell: upgrading to 0.60.8.3 SUCCEEDED
- - -
-
-
-
2026-10-29
auh@yoctoproject.org
New
[AUH] tzcode-native,tzdata: upgrading to 2026f FAILED
[AUH] tzcode-native,tzdata: upgrading to 2026f FAILED
- - -
-
-
-
2026-10-29
auh@yoctoproject.org
New
[AUH] mesa-tools-native,mesa: upgrading to 26.2.6 SUCCEEDED
[AUH] mesa-tools-native,mesa: upgrading to 26.2.6 SUCCEEDED
- - -
-
-
-
2026-10-29
auh@yoctoproject.org
New
[v2] kernel.bbclass: fix -dev files when KERNEL_PACKAGE_NAME is PN
[v2] kernel.bbclass: fix -dev files when KERNEL_PACKAGE_NAME is PN
- - -
-
-
-
2026-10-29
Prasanth R
Under Review
[meta-yocto-bsp,scarthgap,07/07] yocto-bsps: update to v6.6.160
linux-yocto/6.6: -stable updates and aufs refresh
- - -
-
-
-
2026-10-29
Bruce Ashfield
New
[meta-yocto-bsp,scarthgap,06/07] yocto-bsps: update to v6.6.159
linux-yocto/6.6: -stable updates and aufs refresh
- - -
-
-
-
2026-10-29
Bruce Ashfield
New
[meta,scarthgap,05/07] linux-yocto/6.6: aufs: refresh to upstream aufs6.6.84
linux-yocto/6.6: -stable updates and aufs refresh
- - -
-
-
-
2026-10-29
Bruce Ashfield
New
[meta,scarthgap,04/07] linux-yocto/6.6: update to v6.6.160
linux-yocto/6.6: -stable updates and aufs refresh
- - -
-
-
-
2026-10-29
Bruce Ashfield
New
[meta,scarthgap,03/07] linux-yocto/6.6: update to v6.6.159
linux-yocto/6.6: -stable updates and aufs refresh
- - -
-
-
-
2026-10-29
Bruce Ashfield
New
[meta,scarthgap,02/07] linux-yocto/6.6: update to v6.6.157
linux-yocto/6.6: -stable updates and aufs refresh
- - -
-
-
-
2026-10-29
Bruce Ashfield
New
[meta,scarthgap,01/07] linux-yocto/6.6: update to v6.6.156
linux-yocto/6.6: -stable updates and aufs refresh
- - -
-
-
-
2026-10-29
Bruce Ashfield
New
[meta-yocto-bsp,11/11] yocto-bsps: update to v7.2.13
linux-yocto: consolidated pull request
- - -
-
-
-
2026-10-29
Bruce Ashfield
New
[meta-yocto-bsp,10/11] yocto-bsps: update to v6.18.59
linux-yocto: consolidated pull request
- - -
-
-
-
2026-10-29
Bruce Ashfield
New
[meta-yocto-bsp,09/11] yocto-bsps: update to v7.2.11
linux-yocto: consolidated pull request
- - -
-
-
-
2026-10-29
Bruce Ashfield
New
[meta-yocto-bsp,08/11] yocto-bsps: update to v6.18.57
linux-yocto: consolidated pull request
- - -
-
-
-
2026-10-29
Bruce Ashfield
New
[meta,07/11] linux-yocto/7.2: yaffs2: backport upstream fixes and restore remount handling
linux-yocto: consolidated pull request
- - -
-
-
-
2026-10-29
Bruce Ashfield
New
[meta,06/11] linux-yocto/7.2: update to v7.2.13
linux-yocto: consolidated pull request
- - -
-
-
-
2026-10-29
Bruce Ashfield
New
[meta,05/11] linux-yocto/6.18: update to v6.18.59
linux-yocto: consolidated pull request
- - -
-
-
-
2026-10-29
Bruce Ashfield
New
[meta,04/11] linux-yocto/7.2: update to v7.2.11
linux-yocto: consolidated pull request
- - -
-
-
-
2026-10-29
Bruce Ashfield
New
[meta,03/11] linux-yocto/6.18: update to v6.18.57
linux-yocto: consolidated pull request
- - -
-
-
-
2026-10-29
Bruce Ashfield
New
[meta,02/11] linux-yocto/7.2: aufs: refresh to upstream aufs7.2
linux-yocto: consolidated pull request
- - -
-
-
-
2026-10-29
Bruce Ashfield
New
[meta,01/11] linux-yocto/6.18: aufs: refresh to upstream aufs6.18
linux-yocto: consolidated pull request
- - -
-
-
-
2026-10-29
Bruce Ashfield
New
kernel-grub.bbclass: use KERNEL_PACKAGE_NAME for the image packages
kernel-grub.bbclass: use KERNEL_PACKAGE_NAME for the image packages
- - -
-
-
-
2026-10-29
Prasanth R
Under Review
kernel.bbclass: fix -dev files when KERNEL_PACKAGE_NAME is PN
kernel.bbclass: fix -dev files when KERNEL_PACKAGE_NAME is PN
- - -
-
-
-
2026-10-29
Prasanth R
New
[v7,8/8] ovmf: Allow empty SPDX deploy artifacts
Implement SPDX for deploy tasks
- - -
-
-
-
2026-10-28
Joshua Watt
Under Review
[v7,7/8] layer.conf: Fix initramfs-framework not knowing which udev it has
Implement SPDX for deploy tasks
- - -
-
-
-
2026-10-28
Joshua Watt
Under Review
[v7,6/8] spdx: Replace do_create_image_spdx with deploy task
Implement SPDX for deploy tasks
- - -
-
-
-
2026-10-28
Joshua Watt
Under Review
[v7,5/8] classes-recipe/deploy: Add do_deploy to SPDX_DEPLOY_TASKS
Implement SPDX for deploy tasks
- - -
-
-
-
2026-10-28
Joshua Watt
Under Review
[v7,4/8] classes-global/sstate: Keep SPDX generating setscene dependencies
Implement SPDX for deploy tasks
- - -
-
-
-
2026-10-28
Joshua Watt
Under Review
[v7,3/8] oeqa: Add SPDX deploy SBoM test
Implement SPDX for deploy tasks
- - -
-
-
-
2026-10-28
Joshua Watt
Under Review
[v7,2/8] spdx: Add ability for deploy tasks to create SPDX
Implement SPDX for deploy tasks
- - -
-
-
-
2026-10-28
Joshua Watt
Under Review
[v7,1/8] spdx: Skip dependencies that are not in the taskhash
Implement SPDX for deploy tasks
- - -
-
-
-
2026-10-28
Joshua Watt
Under Review
[wrynose,v3] python3-pip: patch the vendored python3-certifi
[wrynose,v3] python3-pip: patch the vendored python3-certifi
- - -
-
-
-
2026-10-28
Jeroen Hofstee
New
[3/3] kernel-fit-image: drop the synthetic FIT_LOADABLE_* values
oeqa/utils/commands: add get_bb_vars_flags and build get_bb_var(s) on it
- - -
-
-
-
2026-10-28
AdrianF
Under Review
[2/3] oeqa/utils/commands: use get_bb_vars_flags in get_bb_var
oeqa/utils/commands: add get_bb_vars_flags and build get_bb_var(s) on it
- - -
-
-
-
2026-10-28
AdrianF
Under Review
[1/3] oeqa/utils/commands: add get_bb_vars_flags
oeqa/utils/commands: add get_bb_vars_flags and build get_bb_var(s) on it
- - -
-
-
-
2026-10-28
AdrianF
Under Review
[poky,scarthgap,v2] systemd: try AT_EMPTY_PATH for access_fd() first
[poky,scarthgap,v2] systemd: try AT_EMPTY_PATH for access_fd() first
- - -
-
-
-
2026-10-28
Suresh H A
ycongal_smile
Under Review
dropbear: don't delete host keys during package updates
dropbear: don't delete host keys during package updates
- - -
-
-
-
2026-10-28
Koen Kooi
Under Review
[RFC,v2] pkcs11-provider: import version 1.3.0 from meta-oe
[RFC,v2] pkcs11-provider: import version 1.3.0 from meta-oe
- - -
-
-
-
2026-10-28
Ayoub Zaki
New
libjpeg-turbo: Upgrade 3.2.0 -> 3.2.1
libjpeg-turbo: Upgrade 3.2.0 -> 3.2.1
- - -
-
-
-
2026-10-28
Jaipaul Cheernam
Under Review
[wrynose] recipe_sanity: Drop rename overwrite detection
[wrynose] recipe_sanity: Drop rename overwrite detection
- - -
-
-
-
2026-10-28
Anuj Mittal
ycongal_smile
New
[3/3] buildtools-docs-tarball: add nativesdk-python3-sphinx-tags
Add python3-sphinx-tags recipe to buildtools-docs-tarball
- - -
-
-
-
2026-10-28
Antonin Godard
Under Review
[2/3] python3-sphinx-tags: add recipe
Add python3-sphinx-tags recipe to buildtools-docs-tarball
- - -
-
-
-
2026-10-28
Antonin Godard
Under Review
[1/3] python3-sphinx-design: add recipe
Add python3-sphinx-tags recipe to buildtools-docs-tarball
- - -
-
-
-
2026-10-28
Antonin Godard
Under Review
[8/8] python3-pdm: upgrade 2.29.2 -> 2.29.4
Upgrades on 28th October
- - -
-
-
-
2026-10-28
Jaipaul Cheernam
Under Review
«
1
2
3
4
…
157
158
»