Toggle navigation
Patchwork
OpenEmbedded Core Layer
Patches
Bundles
About this project
Login
Register
Mail settings
Show patches with
: State =
Action Required
| Archived =
No
| 15553 patches
Series
Submitter
State
any
Action Required
New
Under Review
Accepted
Rejected
RFC
Not Applicable
Changes Requested
Awaiting Upstream
Superseded
Deferred
Search
Archived
No
Yes
Both
Delegate
------
Nobody
gitpwbot
gitpwbot
gitpwbot
gitpwbot
gitpwbot
gitpwbot
gitpwbot
gitpwbot
mototimo
mototimo
mototimo
kraj
kraj
denix
denix
reatmon
reatmon
rpurdie
rpurdie
rpurdie
rpurdie
sakoman
ycongal_smile
ycongal_smile
ycongal_smile
rossburton
rossburton
jonmason
abelloni
abelloni
agodard
mathieu
anujm
fatho
fatho
fatho
boucman
boucman
boucman
Apply
«
1
2
3
4
…
155
156
»
Patch
Series
A/R/T
S/W/F
Date
Submitter
Delegate
State
[2/2] oe-pkgdata-util: use PACKAGE_BASENAME for glob PN-substitution fallback
Fix kernel complementary package installation
- - -
-
-
-
2026-09-21
AdrianF
New
[1/2] package: introduce PACKAGE_BASENAME for consistent kernel -src naming
Fix kernel complementary package installation
- - -
-
-
-
2026-09-21
AdrianF
New
[v2,3/3] nfs-utils: upgrade 2.9.2 -> 3.1.1
systemd musl build fixes and nfs-utils upgrade
- - -
-
-
-
2026-09-21
Jaipaul Cheernam
New
[v2,2/3] systemd: dlopen-deps: only warn for missing required providers
systemd musl build fixes and nfs-utils upgrade
- - -
-
-
-
2026-09-21
Jaipaul Cheernam
New
[v2,1/3] systemd: fix musl build by fixing limits.h override
systemd musl build fixes and nfs-utils upgrade
- - -
-
-
-
2026-09-21
Jaipaul Cheernam
New
[scarthgap,v2] python3: skip ptest incompatible with ptest-runner >= 2.5.0
[scarthgap,v2] python3: skip ptest incompatible with ptest-runner >= 2.5.0
- - -
-
-
-
2026-09-21
Yoann Congal
New
[scarthgap,v2,7/7] libpcap: Fix CVE-2026-18238
libpcap: backport seven CVE fixes from 1.10.7
- - -
-
-
-
2026-09-21
Jaipaul Cheernam
New
[scarthgap,v2,6/7] libpcap: Fix CVE-2026-18313
libpcap: backport seven CVE fixes from 1.10.7
- - -
-
-
-
2026-09-21
Jaipaul Cheernam
New
[scarthgap,v2,5/7] libpcap: Fix CVE-2026-6554
libpcap: backport seven CVE fixes from 1.10.7
- - -
-
-
-
2026-09-21
Jaipaul Cheernam
New
[scarthgap,v2,4/7] libpcap: Fix CVE-2026-6244
libpcap: backport seven CVE fixes from 1.10.7
- - -
-
-
-
2026-09-21
Jaipaul Cheernam
New
[scarthgap,v2,3/7] libpcap: Fix CVE-2026-31911
libpcap: backport seven CVE fixes from 1.10.7
- - -
-
-
-
2026-09-21
Jaipaul Cheernam
New
[scarthgap,v2,2/7] libpcap: Fix CVE-2026-31912
libpcap: backport seven CVE fixes from 1.10.7
- - -
-
-
-
2026-09-21
Jaipaul Cheernam
New
[scarthgap,v2,1/7] libpcap: Fix CVE-2026-0799
libpcap: backport seven CVE fixes from 1.10.7
- - -
-
-
-
2026-09-21
Jaipaul Cheernam
New
[5/5] utfcpp: upgrade 4.2.0 -> 4.2.1
[1/5] cairo: upgrade 1.18.4 -> 1.18.6
- - -
-
-
-
2026-09-21
Richard Purdie
New
[4/5] stress-ng: upgrade 0.22.00 -> 0.22.01
[1/5] cairo: upgrade 1.18.4 -> 1.18.6
- - -
-
-
-
2026-09-21
Richard Purdie
New
[3/5] python3-pyparsing: upgrade 3.3.2 -> 3.3.3
[1/5] cairo: upgrade 1.18.4 -> 1.18.6
- - -
-
-
-
2026-09-21
Richard Purdie
New
[2/5] harfbuzz: upgrade 14.4.0 -> 14.5.0
[1/5] cairo: upgrade 1.18.4 -> 1.18.6
- - -
-
-
-
2026-09-21
Richard Purdie
New
[1/5] cairo: upgrade 1.18.4 -> 1.18.6
[1/5] cairo: upgrade 1.18.4 -> 1.18.6
- - -
-
-
-
2026-09-21
Richard Purdie
New
[scarthgap] python3: skip ptest incompatible with ptest-runner >= 2.5.0
[scarthgap] python3: skip ptest incompatible with ptest-runner >= 2.5.0
- - -
-
-
-
2026-09-21
Yoann Congal
New
udev-extraconf: Add missing commas in udev rules
udev-extraconf: Add missing commas in udev rules
- - -
-
-
-
2026-09-21
Jonas Mark (BT-EL/ESW1)
New
[v3] psmisc: add ptest support
[v3] psmisc: add ptest support
- - -
-
-
-
2026-09-21
Pratik Farkase
New
[v3] psmisc: add ptest support
[v3] psmisc: add ptest support
- - -
-
-
-
2026-09-21
Pratik Farkase
New
qemuriscv.inc: default to fw_dynamic.elf as QEMU BIOS
qemuriscv.inc: default to fw_dynamic.elf as QEMU BIOS
- - -
-
-
-
2026-09-21
Harish Sadineni
New
gcc: fix check for working assembler --gdwarf-4 option
gcc: fix check for working assembler --gdwarf-4 option
- - -
-
-
-
2026-09-21
Ross Burton
New
[3/3] nfs-utils: upgrade 2.9.2 -> 3.1.1
nfs-utils: musl upgrade to 3.1.1 and prerequisite systemd fixes
- - -
-
-
-
2026-09-21
Jaipaul Cheernam
New
[2/3] systemd: dlopen-deps: only warn for missing required providers
nfs-utils: musl upgrade to 3.1.1 and prerequisite systemd fixes
- - -
-
-
-
2026-09-21
Jaipaul Cheernam
New
[1/3] systemd: fix musl build by providing missing POSIX limits
nfs-utils: musl upgrade to 3.1.1 and prerequisite systemd fixes
- - -
-
-
-
2026-09-21
Jaipaul Cheernam
New
[v2] tiff: add ptest support
[v2] tiff: add ptest support
- - -
-
-
-
2026-09-21
Himani Ramesh Barde
New
[scarthgap] alsa-lib: Add ptest
[scarthgap] alsa-lib: Add ptest
- - -
-
-
-
2026-09-21
Sana Kazi
New
[master,PATCHv2] alsa-lib: Add ptest
[master,PATCHv2] alsa-lib: Add ptest
- - -
-
-
-
2026-09-21
Sana Kazi
New
[wrynose] alsa-lib: Add ptest
[wrynose] alsa-lib: Add ptest
- - -
-
-
-
2026-09-21
Sana Kazi
New
[wrynose] alsa-lib: Add ptest
[wrynose] alsa-lib: Add ptest
- - -
-
-
-
2026-09-21
Sana Kazi
New
[18/20] ruby: upgrade 4.0.6 -> 4.0.7
[01/20] ffmpeg: upgrade 9.0.1 -> 9.0.2
- - -
-
-
-
2026-09-21
Richard Purdie
New
[17/20] python3-urllib3: upgrade 2.7.0 -> 2.8.0
[01/20] ffmpeg: upgrade 9.0.1 -> 9.0.2
- - -
-
-
-
2026-09-21
Richard Purdie
New
[15/20] fastfloat: upgrade 8.2.10 -> 8.3.0
[01/20] ffmpeg: upgrade 9.0.1 -> 9.0.2
- - -
-
-
-
2026-09-21
Richard Purdie
New
[14/20] python3-vcs-versioning: upgrade 2.4.0 -> 2.4.1
[01/20] ffmpeg: upgrade 9.0.1 -> 9.0.2
- - -
-
-
-
2026-09-21
Richard Purdie
New
[13/20] python3-pdm-build-locked: upgrade 0.3.7 -> 0.3.8
[01/20] ffmpeg: upgrade 9.0.1 -> 9.0.2
- - -
-
-
-
2026-09-21
Richard Purdie
New
[12/20] mesa: upgrade 26.2.2 -> 26.2.3
[01/20] ffmpeg: upgrade 9.0.1 -> 9.0.2
- - -
-
-
-
2026-09-21
Richard Purdie
New
[10/20] barebox-tools: upgrade 2026.08.0 -> 2026.09.0
[01/20] ffmpeg: upgrade 9.0.1 -> 9.0.2
- - -
-
-
-
2026-09-21
Richard Purdie
New
[09/20] python3-wcwidth: upgrade 0.8.3 -> 0.8.4
[01/20] ffmpeg: upgrade 9.0.1 -> 9.0.2
- - -
-
-
-
2026-09-21
Richard Purdie
New
[08/20] python3-pdm: upgrade 2.29.1 -> 2.29.2
[01/20] ffmpeg: upgrade 9.0.1 -> 9.0.2
- - -
-
-
-
2026-09-21
Richard Purdie
New
[07/20] python3-idna: upgrade 3.19 -> 3.20
[01/20] ffmpeg: upgrade 9.0.1 -> 9.0.2
- - -
-
-
-
2026-09-21
Richard Purdie
New
[06/20] python3-hatchling: upgrade 1.32.0 -> 1.32.3
[01/20] ffmpeg: upgrade 9.0.1 -> 9.0.2
- - -
-
-
-
2026-09-21
Richard Purdie
New
[05/20] xxhash: upgrade 0.8.3 -> 0.8.4
[01/20] ffmpeg: upgrade 9.0.1 -> 9.0.2
- - -
-
-
-
2026-09-21
Richard Purdie
New
[04/20] python3-uv-build: upgrade 0.12.13 -> 0.12.17
[01/20] ffmpeg: upgrade 9.0.1 -> 9.0.2
- - -
-
-
-
2026-09-21
Richard Purdie
New
[03/20] python3-dtschema: upgrade 2026.6 -> 2026.9
[01/20] ffmpeg: upgrade 9.0.1 -> 9.0.2
- - -
-
-
-
2026-09-21
Richard Purdie
New
[02/20] librsvg: upgrade 2.63.0 -> 2.63.2
[01/20] ffmpeg: upgrade 9.0.1 -> 9.0.2
- - -
-
-
-
2026-09-21
Richard Purdie
New
[01/20] ffmpeg: upgrade 9.0.1 -> 9.0.2
[01/20] ffmpeg: upgrade 9.0.1 -> 9.0.2
- - -
-
-
-
2026-09-21
Richard Purdie
New
[AUH] utfcpp: upgrading to 4.2.1 SUCCEEDED
[AUH] utfcpp: upgrading to 4.2.1 SUCCEEDED
- - -
-
-
-
2026-09-21
auh@yoctoproject.org
New
[AUH] fribidi: upgrading to 1.0.17 SUCCEEDED
[AUH] fribidi: upgrading to 1.0.17 SUCCEEDED
- - -
-
-
-
2026-09-21
auh@yoctoproject.org
New
[AUH] gzip: upgrading to 1.15 SUCCEEDED
[AUH] gzip: upgrading to 1.15 SUCCEEDED
- - -
-
-
-
2026-09-21
auh@yoctoproject.org
New
[AUH] rsync: upgrading to 3.5.1 FAILED
[AUH] rsync: upgrading to 3.5.1 FAILED
- - -
-
-
-
2026-09-21
auh@yoctoproject.org
New
[AUH] harfbuzz: upgrading to 14.5.0 SUCCEEDED
[AUH] harfbuzz: upgrading to 14.5.0 SUCCEEDED
- - -
-
-
-
2026-09-21
auh@yoctoproject.org
New
[AUH] cairo: upgrading to 1.18.6 SUCCEEDED
[AUH] cairo: upgrading to 1.18.6 SUCCEEDED
- - -
-
-
-
2026-09-21
auh@yoctoproject.org
New
[AUH] stress-ng: upgrading to 0.22.01 SUCCEEDED
[AUH] stress-ng: upgrading to 0.22.01 SUCCEEDED
- - -
-
-
-
2026-09-21
auh@yoctoproject.org
New
[AUH] python3-hatchling: upgrading to 1.32.4 SUCCEEDED
[AUH] python3-hatchling: upgrading to 1.32.4 SUCCEEDED
- - -
-
-
-
2026-09-21
auh@yoctoproject.org
New
[AUH] python3-pyparsing: upgrading to 3.3.3 SUCCEEDED
[AUH] python3-pyparsing: upgrading to 3.3.3 SUCCEEDED
- - -
-
-
-
2026-09-21
auh@yoctoproject.org
New
[wrynose,5/5] python3-sbom-cve-check: update to version 1.3.5
[wrynose,1/5] sbom-cve-check-update-nvd-native,sbom-cve-check-update-cvelist-native: upgrade 2026.0…
- - -
-
-
-
2026-09-20
Marko, Peter
New
[wrynose,4/5] sbom-cve-check-update-{nvd-native,cvelist-native}: upgrade 2026.08.25 -> 2026.09.12
[wrynose,1/5] sbom-cve-check-update-nvd-native,sbom-cve-check-update-cvelist-native: upgrade 2026.0…
- - -
-
-
-
2026-09-20
Marko, Peter
New
[wrynose,3/5] python3-sbom-cve-check: update to version 1.3.4
[wrynose,1/5] sbom-cve-check-update-nvd-native,sbom-cve-check-update-cvelist-native: upgrade 2026.0…
- - -
-
-
-
2026-09-20
Marko, Peter
New
[wrynose,2/5] sbom-cve-check-update-db: Exclude recipes from rm_work
[wrynose,1/5] sbom-cve-check-update-nvd-native,sbom-cve-check-update-cvelist-native: upgrade 2026.0…
- - -
-
-
-
2026-09-20
Marko, Peter
New
[wrynose,1/5] sbom-cve-check-update-nvd-native,sbom-cve-check-update-cvelist-native: upgrade 2026.0…
[wrynose,1/5] sbom-cve-check-update-nvd-native,sbom-cve-check-update-cvelist-native: upgrade 2026.0…
- - -
-
-
-
2026-09-20
Marko, Peter
New
[v2] systemtap: Upgrade 5.5 -> 5.6
[v2] systemtap: Upgrade 5.5 -> 5.6
- - -
-
-
-
2026-09-20
Jaipaul Cheernam
New
[AUH] puzzles: upgrading to ea09098d71db949351437eba1920033d3a08f491 SUCCEEDED
[AUH] puzzles: upgrading to ea09098d71db949351437eba1920033d3a08f491 SUCCEEDED
- - -
-
-
-
2026-09-20
auh@yoctoproject.org
New
[AUH] python3-poetry-core: upgrading to 2.5.0 SUCCEEDED
[AUH] python3-poetry-core: upgrading to 2.5.0 SUCCEEDED
- - -
-
-
-
2026-09-20
auh@yoctoproject.org
New
[scarthgap] at-spi2-core: RDEPENDS on gsettings-desktop-schemas
[scarthgap] at-spi2-core: RDEPENDS on gsettings-desktop-schemas
- - -
-
-
-
2026-09-19
Tim Orling
ycongal_smile
New
oeqa/selftest: add fs-uuid.bbclass coverage
oeqa/selftest: add fs-uuid.bbclass coverage
- - -
-
-
-
2026-09-19
Angel2Eyes
New
[wrynose] at-spi2-core: RDEPENDS on gsettings-desktop-schemas
[wrynose] at-spi2-core: RDEPENDS on gsettings-desktop-schemas
- - -
-
-
-
2026-09-19
Tim Orling
New
[3/3] at-spi2-core: upgrade 2.60.6 -> 2.62.0.1
[1/3] at-spi2-core: RDEPENDS on gsettings-desktop-schemas
- - -
-
-
-
2026-09-19
Tim Orling
New
systemtap: Upgrade 5.5 -> 5.6
systemtap: Upgrade 5.5 -> 5.6
- - -
-
-
-
2026-09-19
Jaipaul Cheernam
New
[wrynose] toolchain-scripts: fix kernel host tool builds broken in the SDK
[wrynose] toolchain-scripts: fix kernel host tool builds broken in the SDK
- - -
-
-
-
2026-09-19
Daniel Dragomir
ycongal_smile
New
[AUH] xxhash: upgrading to 0.8.4 SUCCEEDED
[AUH] xxhash: upgrading to 0.8.4 SUCCEEDED
- - -
-
-
-
2026-09-19
auh@yoctoproject.org
New
[AUH] ffmpeg: upgrading to 9.0.2 SUCCEEDED
[AUH] ffmpeg: upgrading to 9.0.2 SUCCEEDED
- - -
-
-
-
2026-09-19
auh@yoctoproject.org
New
[AUH] python3-uv-build: upgrading to 0.12.17 SUCCEEDED
[AUH] python3-uv-build: upgrading to 0.12.17 SUCCEEDED
- - -
-
-
-
2026-09-19
auh@yoctoproject.org
New
[AUH] librsvg: upgrading to 2.63.2 SUCCEEDED
[AUH] librsvg: upgrading to 2.63.2 SUCCEEDED
- - -
-
-
-
2026-09-19
auh@yoctoproject.org
New
[AUH] python3-dtschema: upgrading to 2026.9 SUCCEEDED
[AUH] python3-dtschema: upgrading to 2026.9 SUCCEEDED
- - -
-
-
-
2026-09-19
auh@yoctoproject.org
New
xorgproto: Set ALLOW_EMPTY for the main package
xorgproto: Set ALLOW_EMPTY for the main package
- - -
-
-
-
2026-09-18
Jonas Mark (BT-EL/ESW1)
New
[wrynose] core-image-ptest: raise ptest timeout for openssl
[wrynose] core-image-ptest: raise ptest timeout for openssl
- - -
-
-
-
2026-09-18
Pratik Farkase
ycongal_smile
New
[v1] core-image-ptest: raise ptest timeout for openssl
[v1] core-image-ptest: raise ptest timeout for openssl
- - -
-
-
-
2026-09-18
Pratik Farkase
New
[wrynose,v2] vim: Fix CVE-2026-28417 hostname regression
[wrynose,v2] vim: Fix CVE-2026-28417 hostname regression
- - -
-
-
-
2026-09-18
Devansh Patel -X (devanshp - E INFOCHIPS PRIVATE LIMITED at Cisco)
ycongal_smile
New
[v2] psmisc: add ptest support
[v2] psmisc: add ptest support
- - -
-
-
-
2026-09-18
Pratik Farkase
New
[v2,RESEND] classes/archiver: fix tarball content in "original" mode
[v2,RESEND] classes/archiver: fix tarball content in "original" mode
- - -
-
-
-
2026-09-18
João Marcos Costa
New
ptest-packagelists.inc: disable gnutls for RISCV64
ptest-packagelists.inc: disable gnutls for RISCV64
- - -
-
-
-
2026-09-18
João Marcos Costa
New
[v2] python3-hatchling: upgrade 1.32.0 -> 1.32.3
[v2] python3-hatchling: upgrade 1.32.0 -> 1.32.3
- - -
-
-
-
2026-09-18
Ross Burton
New
libdnf: upgrade 0.75.0 -> 0.76.0
libdnf: upgrade 0.75.0 -> 0.76.0
- - -
-
-
-
2026-09-18
Jaipaul Cheernam
New
[AUH] less: upgrading to 710 SUCCEEDED
[AUH] less: upgrading to 710 SUCCEEDED
- - -
-
-
-
2026-09-18
auh@yoctoproject.org
New
[AUH] python3-wcwidth: upgrading to 0.8.4 SUCCEEDED
[AUH] python3-wcwidth: upgrading to 0.8.4 SUCCEEDED
- - -
-
-
-
2026-09-18
auh@yoctoproject.org
New
[AUH] python3-hatchling: upgrading to 1.32.3 SUCCEEDED
[AUH] python3-hatchling: upgrading to 1.32.3 SUCCEEDED
- - -
-
-
-
2026-09-18
auh@yoctoproject.org
New
[AUH] python3-uv-build: upgrading to 0.12.16 SUCCEEDED
[AUH] python3-uv-build: upgrading to 0.12.16 SUCCEEDED
- - -
-
-
-
2026-09-18
auh@yoctoproject.org
New
[AUH] python3-idna: upgrading to 3.20 SUCCEEDED
[AUH] python3-idna: upgrading to 3.20 SUCCEEDED
- - -
-
-
-
2026-09-18
auh@yoctoproject.org
New
[AUH] python3-pdm: upgrading to 2.29.2 SUCCEEDED
[AUH] python3-pdm: upgrading to 2.29.2 SUCCEEDED
- - -
-
-
-
2026-09-18
auh@yoctoproject.org
New
[AUH] tzcode-native,tzdata: upgrading to 2026d,2026d FAILED
[AUH] tzcode-native,tzdata: upgrading to 2026d,2026d FAILED
- - -
-
-
-
2026-09-18
auh@yoctoproject.org
New
[v2,2/2] libsecret: upgrade 0.21.7 -> 0.21.8.2
libsecret: upgrade to 0.21.8.2 and fix gnomebase verdir
- - -
-
-
-
2026-09-17
Jaipaul Cheernam
New
[v2,1/2] gnomebase: fix gnome_verdir for four-component versions
libsecret: upgrade to 0.21.8.2 and fix gnomebase verdir
- - -
-
-
-
2026-09-17
Jaipaul Cheernam
New
[meta-oe,master] linux-firmware: split out iwlwifi-ty firmware into separate package
[meta-oe,master] linux-firmware: split out iwlwifi-ty firmware into separate package
- - -
-
-
-
2026-09-17
Aksh Garg
New
[wrynose] fmt: update branch name to main
[wrynose] fmt: update branch name to main
- - -
-
-
-
2026-09-17
Marko, Peter
ycongal_smile
New
[scarthgap] gcc: Upgrade to GCC 13.5
[scarthgap] gcc: Upgrade to GCC 13.5
- - -
-
-
-
2026-09-17
Hemanth Kumar M D
ycongal_smile
Under Review
[wrynose,PATCHv2] libgcrypt: Update license for dbg package
[wrynose,PATCHv2] libgcrypt: Update license for dbg package
- - -
-
-
-
2026-09-17
Sana Kazi
ycongal_smile
New
[master] libgcrypt: Update license for dbg package
[master] libgcrypt: Update license for dbg package
- - -
-
-
-
2026-09-17
Sana Kazi
New
[2/2] libsecret: upgrade 0.21.7 -> 0.21.8.2
libsecret: upgrade 0.21.7 -> 0.21.8.2
- - -
-
-
-
2026-09-17
Jaipaul Cheernam
New
«
1
2
3
4
…
155
156
»