Show patches with: Archived = No       |   15115 patches
« 1 2 ... 8 9 10151 152 »
Patch Series A/R/T S/W/F Date Submitter Delegate State
spirv-llvm-translator: drop tag from the SRC_URI spirv-llvm-translator: drop tag from the SRC_URI - - - --- 2025-07-16 Dmitry Baryshkov New
[master,walnascar,1/1] gnutls: upgrade 3.8.9 -> 3.8.10 [master,walnascar,1/1] gnutls: upgrade 3.8.9 -> 3.8.10 - - - --- 2025-07-16 Polampalli, Archana Changes Requested
[walnascar] kea: set correct permissions for /var/run/kea [walnascar] kea: set correct permissions for /var/run/kea - - - --- 2025-07-16 Yi Zhao sakoman Accepted
[walnascar] binutils: Fix CVE-2025-7546 [walnascar] binutils: Fix CVE-2025-7546 - - - --- 2025-07-16 Yash Shinde sakoman Accepted
[walnascar,1/1] libxml2: fix CVE-2025-49795 [walnascar,1/1] libxml2: fix CVE-2025-49795 - - - --- 2025-07-16 dchellam sakoman Accepted
[6.12,2/2] arm64: defconfig: enable Maxim TCPCI driver [6.12,1/2] arm64: defconfig: enable DRM_DISPLAY_CONNECTOR as a module 1 1 - --- 2025-07-16 Macpaul Lin (林智斌) New
[6.12,1/2] arm64: defconfig: enable DRM_DISPLAY_CONNECTOR as a module [6.12,1/2] arm64: defconfig: enable DRM_DISPLAY_CONNECTOR as a module - 1 - --- 2025-07-16 Macpaul Lin (林智斌) New
ccache: move environment variables to the configuration file ccache: move environment variables to the configuration file - - - --- 2025-07-16 Ross Burton New
[walnascar,2/2] binutils: Fix CVE-2025-7545 [walnascar,1/2] binutils: Fix CVE-2025-5245 - - - --- 2025-07-16 Deepesh Varatharajan sakoman Accepted
[walnascar,1/2] binutils: Fix CVE-2025-5245 [walnascar,1/2] binutils: Fix CVE-2025-5245 - - - --- 2025-07-16 Deepesh Varatharajan sakoman Accepted
[1/1] spdx3: Add optional kernel configuration export to build_parameter for virtual/kernel spdx3: Export kernel configuration as build parameters in SPDX output - - - --- 2025-07-16 Kamel Bouhara New
[scarthgap] oe-debuginfod: add option for data storage [scarthgap] oe-debuginfod: add option for data storage - - - --- 2025-07-16 Deepesh Varatharajan sakoman Accepted
[v2] u-boot: upgrade 2025.04 -> 2025.07 [v2] u-boot: upgrade 2025.04 -> 2025.07 - - - --- 2025-07-16 Mikko Rapeli New
vulkan-validation-layers: fix compile failure with DEBUG_BUILD = 1 vulkan-validation-layers: fix compile failure with DEBUG_BUILD = 1 - - - --- 2025-07-16 Hongxu Jia New
kernel-devsrc: copy arch/powerpc/tools contents kernel-devsrc: copy arch/powerpc/tools contents - - - --- 2025-07-16 ChenQi New
systemd: remove 'serial-getty-generator' PACKAGECONFIG systemd: remove 'serial-getty-generator' PACKAGECONFIG - - - --- 2025-07-16 ChenQi New
[AUH] taglib: upgrading to 2.1.1 SUCCEEDED [AUH] taglib: upgrading to 2.1.1 SUCCEEDED - - - --- 2025-07-15 auh@yoctoproject.org New
[AUH] sqlite3: upgrading to 3.50.2 FAILED [AUH] sqlite3: upgrading to 3.50.2 FAILED - - - --- 2025-07-15 auh@yoctoproject.org New
[AUH] libmicrohttpd: upgrading to 1.0.2 SUCCEEDED [AUH] libmicrohttpd: upgrading to 1.0.2 SUCCEEDED - - - --- 2025-07-15 auh@yoctoproject.org New
[AUH] libgit2: upgrading to 1.9.1 FAILED [AUH] libgit2: upgrading to 1.9.1 FAILED - - - --- 2025-07-15 auh@yoctoproject.org New
[AUH] hwdata: upgrading to 0.397 SUCCEEDED [AUH] hwdata: upgrading to 0.397 SUCCEEDED - - - --- 2025-07-15 auh@yoctoproject.org New
[AUH] gnutls: upgrading to 3.8.10 SUCCEEDED [AUH] gnutls: upgrading to 3.8.10 SUCCEEDED - - - --- 2025-07-15 auh@yoctoproject.org New
[AUH] boost-build-native: upgrading to 1.88.0 SUCCEEDED [AUH] boost-build-native: upgrading to 1.88.0 SUCCEEDED - - - --- 2025-07-15 auh@yoctoproject.org New
[AUH] webkitgtk: upgrading to 2.48.3 FAILED [AUH] webkitgtk: upgrading to 2.48.3 FAILED - - - --- 2025-07-15 auh@yoctoproject.org New
[AUH] at-spi2-core: upgrading to 2.56.3 SUCCEEDED [AUH] at-spi2-core: upgrading to 2.56.3 SUCCEEDED - - - --- 2025-07-15 auh@yoctoproject.org New
[AUH] puzzles: upgrading to 880288cbbcb55b2f7b3520a45aefbfc2592dd362 SUCCEEDED [AUH] puzzles: upgrading to 880288cbbcb55b2f7b3520a45aefbfc2592dd362 SUCCEEDED - - - --- 2025-07-15 auh@yoctoproject.org New
[AUH] diffoscope: upgrading to 301 SUCCEEDED [AUH] diffoscope: upgrading to 301 SUCCEEDED - - - --- 2025-07-15 auh@yoctoproject.org New
[AUH] libwebp: upgrading to 1.6.0 SUCCEEDED [AUH] libwebp: upgrading to 1.6.0 SUCCEEDED - - - --- 2025-07-15 auh@yoctoproject.org New
[AUH] libpng: upgrading to 1.6.50 SUCCEEDED [AUH] libpng: upgrading to 1.6.50 SUCCEEDED - - - --- 2025-07-15 auh@yoctoproject.org New
[AUH] wireless-regdb: upgrading to 2025.07.10 SUCCEEDED [AUH] wireless-regdb: upgrading to 2025.07.10 SUCCEEDED - - - --- 2025-07-15 auh@yoctoproject.org New
[AUH] linux-firmware: upgrading to 20250708 SUCCEEDED [AUH] linux-firmware: upgrading to 20250708 SUCCEEDED - - - --- 2025-07-15 auh@yoctoproject.org New
[AUH] xkeyboard-config: upgrading to 2.45 FAILED [AUH] xkeyboard-config: upgrading to 2.45 FAILED - - - --- 2025-07-15 auh@yoctoproject.org New
[AUH] xserver-xorg: upgrading to 21.1.18 SUCCEEDED [AUH] xserver-xorg: upgrading to 21.1.18 SUCCEEDED - - - --- 2025-07-15 auh@yoctoproject.org New
[AUH] xwayland: upgrading to 24.1.8 SUCCEEDED [AUH] xwayland: upgrading to 24.1.8 SUCCEEDED - - - --- 2025-07-15 auh@yoctoproject.org New
[AUH] virglrenderer: upgrading to 1.1.1 FAILED [AUH] virglrenderer: upgrading to 1.1.1 FAILED - - - --- 2025-07-15 auh@yoctoproject.org New
[AUH] libinput: upgrading to 1.28.901 SUCCEEDED [AUH] libinput: upgrading to 1.28.901 SUCCEEDED - - - --- 2025-07-15 auh@yoctoproject.org New
[AUH] piglit: upgrading to 0980079dcfb5adbad873d88e00181268f55cb8ef SUCCEEDED [AUH] piglit: upgrading to 0980079dcfb5adbad873d88e00181268f55cb8ef SUCCEEDED - - - --- 2025-07-15 auh@yoctoproject.org New
[AUH] mesa: upgrading to 25.1.5 SUCCEEDED [AUH] mesa: upgrading to 25.1.5 SUCCEEDED - - - --- 2025-07-15 auh@yoctoproject.org New
[AUH] kmscube: upgrading to e05830984e15ae77bd3dbcf41d4cd0a60010dda2 SUCCEEDED [AUH] kmscube: upgrading to e05830984e15ae77bd3dbcf41d4cd0a60010dda2 SUCCEEDED - - - --- 2025-07-15 auh@yoctoproject.org New
[AUH] adwaita-icon-theme: upgrading to 48.1 FAILED [AUH] adwaita-icon-theme: upgrading to 48.1 FAILED - - - --- 2025-07-15 auh@yoctoproject.org New
[AUH] epiphany: upgrading to 48.5 SUCCEEDED [AUH] epiphany: upgrading to 48.5 SUCCEEDED - - - --- 2025-07-15 auh@yoctoproject.org New
[AUH] stress-ng: upgrading to 0.19.02 SUCCEEDED [AUH] stress-ng: upgrading to 0.19.02 SUCCEEDED - - - --- 2025-07-15 auh@yoctoproject.org New
[AUH] quota: upgrading to 4.10 FAILED [AUH] quota: upgrading to 4.10 FAILED - - - --- 2025-07-15 auh@yoctoproject.org New
[AUH] lsof: upgrading to 4.99.5 SUCCEEDED [AUH] lsof: upgrading to 4.99.5 SUCCEEDED - - - --- 2025-07-15 auh@yoctoproject.org New
[AUH] gi-docgen: upgrading to 2025.4 SUCCEEDED [AUH] gi-docgen: upgrading to 2025.4 SUCCEEDED - - - --- 2025-07-15 auh@yoctoproject.org New
[AUH] ltp: upgrading to 20250530 SUCCEEDED [AUH] ltp: upgrading to 20250530 SUCCEEDED - - - --- 2025-07-15 auh@yoctoproject.org New
[AUH] libsolv: upgrading to 0.7.34 SUCCEEDED [AUH] libsolv: upgrading to 0.7.34 SUCCEEDED - - - --- 2025-07-15 auh@yoctoproject.org New
[AUH] less: upgrading to 679 SUCCEEDED [AUH] less: upgrading to 679 SUCCEEDED - - - --- 2025-07-15 auh@yoctoproject.org New
[AUH] tcf-agent: upgrading to 1.9.0 FAILED [AUH] tcf-agent: upgrading to 1.9.0 FAILED - - - --- 2025-07-15 auh@yoctoproject.org New
[AUH] python3-zipp: upgrading to 3.23.0 FAILED [AUH] python3-zipp: upgrading to 3.23.0 FAILED - - - --- 2025-07-15 auh@yoctoproject.org New
[AUH] rpm-sequoia-crypto-policy: upgrading to cd6043a774abf6e4d17116f1497a2032f5351d49 FAILED [AUH] rpm-sequoia-crypto-policy: upgrading to cd6043a774abf6e4d17116f1497a2032f5351d49 FAILED - - - --- 2025-07-15 auh@yoctoproject.org New
[AUH] tcl: upgrading to 9.0.2 SUCCEEDED [AUH] tcl: upgrading to 9.0.2 SUCCEEDED - - - --- 2025-07-15 auh@yoctoproject.org New
[AUH] rpm-sequoia: upgrading to 1.9.0 SUCCEEDED [AUH] rpm-sequoia: upgrading to 1.9.0 SUCCEEDED - - - --- 2025-07-15 auh@yoctoproject.org New
[AUH] python3-typing-extensions: upgrading to 4.14.1 SUCCEEDED [AUH] python3-typing-extensions: upgrading to 4.14.1 SUCCEEDED - - - --- 2025-07-15 auh@yoctoproject.org New
[AUH] python3-unittest-automake-output: upgrading to 0.3 FAILED [AUH] python3-unittest-automake-output: upgrading to 0.3 FAILED - - - --- 2025-07-15 auh@yoctoproject.org New
[AUH] python3-sphinx: upgrading to 8.3.0 SUCCEEDED [AUH] python3-sphinx: upgrading to 8.3.0 SUCCEEDED - - - --- 2025-07-15 auh@yoctoproject.org New
[AUH] python3-maturin: upgrading to 1.9.1 SUCCEEDED [AUH] python3-maturin: upgrading to 1.9.1 SUCCEEDED - - - --- 2025-07-15 auh@yoctoproject.org New
[AUH] python3-rpds-py: upgrading to 0.26.0 SUCCEEDED [AUH] python3-rpds-py: upgrading to 0.26.0 SUCCEEDED - - - --- 2025-07-15 auh@yoctoproject.org New
[AUH] python3-hypothesis: upgrading to 6.135.31 SUCCEEDED [AUH] python3-hypothesis: upgrading to 6.135.31 SUCCEEDED - - - --- 2025-07-15 auh@yoctoproject.org New
[AUH] python3-pdm-backend: upgrading to 2.4.5 SUCCEEDED [AUH] python3-pdm-backend: upgrading to 2.4.5 SUCCEEDED - - - --- 2025-07-15 auh@yoctoproject.org Under Review
[AUH] python3-hatch-vcs: upgrading to 0.5.0 SUCCEEDED [AUH] python3-hatch-vcs: upgrading to 0.5.0 SUCCEEDED - - - --- 2025-07-15 auh@yoctoproject.org New
[AUH] python3-click: upgrading to 8.2.1 SUCCEEDED [AUH] python3-click: upgrading to 8.2.1 SUCCEEDED - - - --- 2025-07-15 auh@yoctoproject.org New
[AUH] python3-certifi: upgrading to 2025.7.14 SUCCEEDED [AUH] python3-certifi: upgrading to 2025.7.14 SUCCEEDED - - - --- 2025-07-15 auh@yoctoproject.org New
[AUH] perl: upgrading to 5.42.0 FAILED [AUH] perl: upgrading to 5.42.0 FAILED - - - --- 2025-07-15 auh@yoctoproject.org New
[AUH] git: upgrading to 2.50.1 SUCCEEDED [AUH] git: upgrading to 2.50.1 SUCCEEDED - - - --- 2025-07-15 auh@yoctoproject.org New
[AUH] erofs-utils: upgrading to 1.8.10 SUCCEEDED [AUH] erofs-utils: upgrading to 1.8.10 SUCCEEDED - - - --- 2025-07-15 auh@yoctoproject.org New
[AUH] debugedit: upgrading to 5.2 SUCCEEDED [AUH] debugedit: upgrading to 5.2 SUCCEEDED - - - --- 2025-07-15 auh@yoctoproject.org New
[AUH] ninja: upgrading to 1.13.1 SUCCEEDED [AUH] ninja: upgrading to 1.13.1 SUCCEEDED - - - --- 2025-07-15 auh@yoctoproject.org Under Review
[AUH] lua: upgrading to 5.4.8 FAILED [AUH] lua: upgrading to 5.4.8 FAILED - - - --- 2025-07-15 auh@yoctoproject.org New
[AUH] e2fsprogs: upgrading to 1.47.3 FAILED [AUH] e2fsprogs: upgrading to 1.47.3 FAILED - - - --- 2025-07-15 auh@yoctoproject.org New
[AUH] libxml2: upgrading to 2.14.4 SUCCEEDED [AUH] libxml2: upgrading to 2.14.4 SUCCEEDED - - - --- 2025-07-15 auh@yoctoproject.org New
[AUH] apt: upgrading to 3.0.3 FAILED [AUH] apt: upgrading to 3.0.3 FAILED - - - --- 2025-07-15 auh@yoctoproject.org New
[AUH] rt-tests,hwlatdetect: upgrading to 2.9,2.9 SUCCEEDED [AUH] rt-tests,hwlatdetect: upgrading to 2.9,2.9 SUCCEEDED - - - --- 2025-07-15 auh@yoctoproject.org New
[AUH] openssh: upgrading to 10.0p2 FAILED [AUH] openssh: upgrading to 10.0p2 FAILED - - - --- 2025-07-15 auh@yoctoproject.org New
[AUH] barebox-tools: upgrading to 2025.07.0 SUCCEEDED [AUH] barebox-tools: upgrading to 2025.07.0 SUCCEEDED - - - --- 2025-07-15 auh@yoctoproject.org New
[AUH] ell: upgrading to 0.78 SUCCEEDED [AUH] ell: upgrading to 0.78 SUCCEEDED - - - --- 2025-07-15 auh@yoctoproject.org New
[AUH] glib-2.0-initial,glib-2.0: upgrading to 2.84.3,2.84.3 SUCCEEDED [AUH] glib-2.0-initial,glib-2.0: upgrading to 2.84.3,2.84.3 SUCCEEDED - - - --- 2025-07-15 auh@yoctoproject.org New
[AUH] systemd-systemctl-native,systemd-boot-native,systemd,systemd-boot: upgrading to 257.7,257.7,2… [AUH] systemd-systemctl-native,systemd-boot-native,systemd,systemd-boot: upgrading to 257.7,257.7,2… - - - --- 2025-07-15 auh@yoctoproject.org New
[AUH] util-linux-libuuid,util-linux: upgrading to 2.41.1,2.41.1 SUCCEEDED [AUH] util-linux-libuuid,util-linux: upgrading to 2.41.1,2.41.1 SUCCEEDED - - - --- 2025-07-15 auh@yoctoproject.org New
[AUH] python3-cryptography,python3-cryptography-vectors: upgrading to 45.0.5,45.0.5 SUCCEEDED [AUH] python3-cryptography,python3-cryptography-vectors: upgrading to 45.0.5,45.0.5 SUCCEEDED - - - --- 2025-07-15 auh@yoctoproject.org New
[AUH] u-boot,u-boot-tools: upgrading to 2025.07,2025.07 SUCCEEDED [AUH] u-boot,u-boot-tools: upgrading to 2025.07,2025.07 SUCCEEDED - - - --- 2025-07-15 auh@yoctoproject.org New
[scarthgap] timedated: wait for jobs before SetNTP response [scarthgap] timedated: wait for jobs before SetNTP response - - - --- 2025-07-15 M. Seben sakoman Accepted
[walnascar] binutils: stable 2.44 branch updates [walnascar] binutils: stable 2.44 branch updates - - - --- 2025-07-15 Deepesh Varatharajan sakoman Accepted
[18/19] u-boot: upgrade 2025.04 -> 2025.07 [01/19] debugedit: upgrade 5.1 -> 5.2 - - - --- 2025-07-15 Wang Mingyu New
[07/19] libinput: upgrade 1.28.1 -> 1.28.901 [01/19] debugedit: upgrade 5.1 -> 5.2 - - - --- 2025-07-15 Wang Mingyu New
[06/19] hwlatdetect: upgrade 2.8 -> 2.9 [01/19] debugedit: upgrade 5.1 -> 5.2 - - - --- 2025-07-15 Wang Mingyu New
[04/19] gnutls: upgrade 3.8.9 -> 3.8.10 [01/19] debugedit: upgrade 5.1 -> 5.2 - - - --- 2025-07-15 Wang Mingyu New
[scarthgap] binutils: stable 2.42 branch updates [scarthgap] binutils: stable 2.42 branch updates - - - --- 2025-07-15 Deepesh Varatharajan sakoman Accepted
[walnascar,15/15] ltp: backport patch to fix compilation error for Skylake -march=x86-64-v3 [walnascar,01/15] icu: fix CVE-2025-5222 - - - --- 2025-07-14 Steve Sakoman sakoman Accepted
[walnascar,14/15] mingetty: fix do_package warning [walnascar,01/15] icu: fix CVE-2025-5222 - - - --- 2025-07-14 Steve Sakoman sakoman Accepted
[walnascar,13/15] ruby: upgrade 3.4.3 -> 3.4.4 [walnascar,01/15] icu: fix CVE-2025-5222 - - - --- 2025-07-14 Steve Sakoman sakoman Accepted
[walnascar,12/15] libpam: upgrade 1.7.0 -> 1.7.1 [walnascar,01/15] icu: fix CVE-2025-5222 - - - --- 2025-07-14 Steve Sakoman sakoman Accepted
[walnascar,11/15] openssl: upgrade 3.4.1 -> 3.4.2 [walnascar,01/15] icu: fix CVE-2025-5222 - - - --- 2025-07-14 Steve Sakoman sakoman Accepted
[walnascar,10/15] sudo: upgrade 1.9.17 -> 1.9.17p1 [walnascar,01/15] icu: fix CVE-2025-5222 - - - --- 2025-07-14 Steve Sakoman sakoman Accepted
[walnascar,09/15] sudo: upgrade 1.9.16p2 -> 1.9.17 [walnascar,01/15] icu: fix CVE-2025-5222 - - - --- 2025-07-14 Steve Sakoman sakoman Accepted
[walnascar,08/15] webkitgtk: upgrade 2.48.1 -> 2.48.2 [walnascar,01/15] icu: fix CVE-2025-5222 - - - --- 2025-07-14 Steve Sakoman sakoman Accepted
[walnascar,07/15] webkitgtk: Use gcc to compile for arm target [walnascar,01/15] icu: fix CVE-2025-5222 - - - --- 2025-07-14 Steve Sakoman sakoman Accepted
[walnascar,06/15] webkitgtk: Fix build break on non-arm/non-x86 systems [walnascar,01/15] icu: fix CVE-2025-5222 - - - --- 2025-07-14 Steve Sakoman sakoman Accepted
[walnascar,05/15] python3: update CVE product [walnascar,01/15] icu: fix CVE-2025-5222 - - - --- 2025-07-14 Steve Sakoman sakoman Accepted
[walnascar,04/15] libsoup: fix CVE-2025-4945 [walnascar,01/15] icu: fix CVE-2025-5222 - - - --- 2025-07-14 Steve Sakoman sakoman Accepted
« 1 2 ... 8 9 10151 152 »