Toggle navigation
Patchwork
OpenEmbedded Core Layer
Patches
Bundles
About this project
Login
Register
Mail settings
Show patches with
: Archived =
No
| 17245 patches
Series
Submitter
State
any
Action Required
New
Under Review
Accepted
Rejected
RFC
Not Applicable
Changes Requested
Awaiting Upstream
Superseded
Deferred
Search
Archived
No
Yes
Both
Delegate
------
Nobody
gitpwbot
gitpwbot
gitpwbot
gitpwbot
gitpwbot
gitpwbot
gitpwbot
gitpwbot
mototimo
mototimo
mototimo
kraj
kraj
denix
denix
reatmon
reatmon
rpurdie
rpurdie
rpurdie
rpurdie
sakoman
ycongal_smile
ycongal_smile
ycongal_smile
rossburton
rossburton
jonmason
abelloni
abelloni
agodard
mathieu
anujm
fatho
fatho
fatho
boucman
boucman
boucman
Apply
«
1
2
...
7
8
9
…
172
173
»
Patch
Series
A/R/T
S/W/F
Date
Submitter
Delegate
State
[meta,04/06] kernel-devsrc: strip riscv vdso-cfi-offsets .cmd file
kernel-yocto: 6.18 and 7.2 RFC/prep
- - -
-
-
-
2026-08-21
Bruce Ashfield
Accepted
[meta,03/06] linux-yocto/7.2: introduce reference kernel recipes
kernel-yocto: 6.18 and 7.2 RFC/prep
- - -
-
-
-
2026-08-21
Bruce Ashfield
Changes Requested
[meta,02/06] linux-libc-headers: update to 7.2
kernel-yocto: 6.18 and 7.2 RFC/prep
- - -
-
-
-
2026-08-21
Bruce Ashfield
Accepted
[meta,01/06] linux-yocto/6.18: update to v6.18.44
kernel-yocto: 6.18 and 7.2 RFC/prep
- - -
-
-
-
2026-08-21
Bruce Ashfield
Accepted
[AUH] libcap-ng-python,libcap-ng: upgrading to 0.9.5,0.9.5 SUCCEEDED
[AUH] libcap-ng-python,libcap-ng: upgrading to 0.9.5,0.9.5 SUCCEEDED
- - -
-
-
-
2026-08-21
auh@yoctoproject.org
New
[v2] toolchain/clang: prepend target host-sys to HOST_CC_ARCH
[v2] toolchain/clang: prepend target host-sys to HOST_CC_ARCH
- - -
-
-
-
2026-08-20
Peter Marko
Under Review
[RFC,v2,1/6] openssl: upgrade 3.5.7 -> 4.0.1
openssl: upgrade to 4.0.1 and fix dependent recipes
- - -
-
-
-
2026-08-20
Jaipaul Cheernam
RFC
[master] cmake-native: use bundled nghttp2 with bundled curl
[master] cmake-native: use bundled nghttp2 with bundled curl
- - -
-
-
-
2026-08-20
Himanshu Jadon -X (hjadon - E INFOCHIPS PRIVATE LIMITED at Cisco)
Under Review
[master] grub: disable grub-protect for native builds
[master] grub: disable grub-protect for native builds
- - -
-
-
-
2026-08-20
Himanshu Jadon -X (hjadon - E INFOCHIPS PRIVATE LIMITED at Cisco)
Under Review
[master] initscripts: avoid service dependency in mountnfs.sh
[master] initscripts: avoid service dependency in mountnfs.sh
- - -
-
-
-
2026-08-20
Shinu Chandran
Under Review
[AUH] stress-ng: upgrading to 0.22.00 SUCCEEDED
[AUH] stress-ng: upgrading to 0.22.00 SUCCEEDED
- - -
-
-
-
2026-08-20
auh@yoctoproject.org
New
[AUH] puzzles: upgrading to 3c3632259d298ab62aafa8a5858823569ab1af46 SUCCEEDED
[AUH] puzzles: upgrading to 3c3632259d298ab62aafa8a5858823569ab1af46 SUCCEEDED
- - -
-
-
-
2026-08-20
auh@yoctoproject.org
New
[AUH] go-binary-native: upgrading to 1.27.0 SUCCEEDED
[AUH] go-binary-native: upgrading to 1.27.0 SUCCEEDED
- - -
-
-
-
2026-08-20
auh@yoctoproject.org
New
[AUH] python3-lxml: upgrading to 6.1.2 SUCCEEDED
[AUH] python3-lxml: upgrading to 6.1.2 SUCCEEDED
- - -
-
-
-
2026-08-20
auh@yoctoproject.org
New
[AUH] webkitgtk: upgrading to 2.52.6 SUCCEEDED
[AUH] webkitgtk: upgrading to 2.52.6 SUCCEEDED
- - -
-
-
-
2026-08-20
auh@yoctoproject.org
New
[AUH] python3-vcs-versioning: upgrading to 2.3.1 SUCCEEDED
[AUH] python3-vcs-versioning: upgrading to 2.3.1 SUCCEEDED
- - -
-
-
-
2026-08-20
auh@yoctoproject.org
New
[AUH] bind: upgrading to 9.20.27 SUCCEEDED
[AUH] bind: upgrading to 9.20.27 SUCCEEDED
- - -
-
-
-
2026-08-20
auh@yoctoproject.org
New
[AUH] erofs-utils: upgrading to 1.9.4 SUCCEEDED
[AUH] erofs-utils: upgrading to 1.9.4 SUCCEEDED
- - -
-
-
-
2026-08-20
auh@yoctoproject.org
New
recipe_sanity: accept new renameVar() arguments in the monkey-patch
recipe_sanity: accept new renameVar() arguments in the monkey-patch
- - -
-
-
-
2026-08-20
Dmitry Baryshkov
Changes Requested
kernel-fit-image: Don't add hash node when signing is enabled
kernel-fit-image: Don't add hash node when signing is enabled
- - -
-
-
-
2026-08-19
Jonas Juffinger via B4 Relay
Changes Requested
[v2,5/5] oeqa/selftest/imagefeatures: test an empty IMAGE_LINK_NAME
Handle an empty IMAGE_LINK_NAME consistently
- - -
-
-
-
2026-08-19
Thomas Roos
Changes Requested
[v2,4/5] image_types: skip multiubi symlinks when IMAGE_LINK_NAME is empty
Handle an empty IMAGE_LINK_NAME consistently
- - -
-
-
-
2026-08-19
Thomas Roos
Changes Requested
[v2,3/5] testexport: fall back to IMAGE_NAME when IMAGE_LINK_NAME is empty
Handle an empty IMAGE_LINK_NAME consistently
- - -
-
-
-
2026-08-19
Thomas Roos
Changes Requested
[v2,2/5] vex: skip the VEX symlink when IMAGE_LINK_NAME is empty
Handle an empty IMAGE_LINK_NAME consistently
- - -
-
-
-
2026-08-19
Thomas Roos
Changes Requested
[v2,1/5] sbom-cve-check: read the image SBOM through the stable symlink
Handle an empty IMAGE_LINK_NAME consistently
- - -
-
-
-
2026-08-19
Thomas Roos
Changes Requested
[AUH] strace: upgrading to 7.2 SUCCEEDED
[AUH] strace: upgrading to 7.2 SUCCEEDED
- - -
-
-
-
2026-08-19
auh@yoctoproject.org
New
[AUH] python3-idna: upgrading to 3.19 SUCCEEDED
[AUH] python3-idna: upgrading to 3.19 SUCCEEDED
- - -
-
-
-
2026-08-19
auh@yoctoproject.org
New
[AUH] python3-vcs-versioning: upgrading to 2.3.0 SUCCEEDED
[AUH] python3-vcs-versioning: upgrading to 2.3.0 SUCCEEDED
- - -
-
-
-
2026-08-19
auh@yoctoproject.org
New
licences: Move exceptions to subdirectory
licences: Move exceptions to subdirectory
- - -
-
-
-
2026-08-18
Joshua Watt
Changes Requested
classes/archiver: fix tarball content in "original" mode
classes/archiver: fix tarball content in "original" mode
- - -
-
-
-
2026-08-18
Joao Marcos Costa
Changes Requested
[AUH] libevdev: upgrading to 1.13.7 SUCCEEDED
[AUH] libevdev: upgrading to 1.13.7 SUCCEEDED
- - -
-
-
-
2026-08-18
auh@yoctoproject.org
New
[AUH] python3-pygments: upgrading to 2.21.0 SUCCEEDED
[AUH] python3-pygments: upgrading to 2.21.0 SUCCEEDED
- - -
-
-
-
2026-08-18
auh@yoctoproject.org
New
[AUH] python3-pdm: upgrading to 2.28.2 SUCCEEDED
[AUH] python3-pdm: upgrading to 2.28.2 SUCCEEDED
- - -
-
-
-
2026-08-18
auh@yoctoproject.org
New
[AUH] dhcpcd: upgrading to 10.5.2 SUCCEEDED
[AUH] dhcpcd: upgrading to 10.5.2 SUCCEEDED
- - -
-
-
-
2026-08-18
auh@yoctoproject.org
New
[v2,1/4] lttng-modules: fix build with kernel 7.2
Fixes for kernel 7.2
- - -
-
-
-
2026-08-17
Mikko Rapeli
Superseded
[meta-oe] linux-firmware: split out iwlwifi 5000-5 firmware
[meta-oe] linux-firmware: split out iwlwifi 5000-5 firmware
- - -
-
-
-
2026-08-17
Thorsten Schmelzer
Under Review
[v1] procps: ptest: skip kill test due to race condition
[v1] procps: ptest: skip kill test due to race condition
- - -
-
-
-
2026-08-17
Pratik Farkase
Superseded
[AUH] ca-certificates: upgrading to 20260816 SUCCEEDED
[AUH] ca-certificates: upgrading to 20260816 SUCCEEDED
- - -
-
-
-
2026-08-17
auh@yoctoproject.org
New
[AUH] makedepend: upgrading to 1.0.10 SUCCEEDED
[AUH] makedepend: upgrading to 1.0.10 SUCCEEDED
- - -
-
-
-
2026-08-17
auh@yoctoproject.org
New
[AUH] python3-hypothesis: upgrading to 6.165.10 SUCCEEDED
[AUH] python3-hypothesis: upgrading to 6.165.10 SUCCEEDED
- - -
-
-
-
2026-08-17
auh@yoctoproject.org
New
[v15,12/12] lib/oe/package_manager/rpm: Enable DNF filelists to resolve file deps
rpm: 4.20.1 -> 6.0.2
- - -
-
-
-
2026-08-16
Gavini, Sumanth
Changes Requested
[v15,11/12] package_rpm.bbclass: Suppress pkgconfig() Requires for sstate compatibility
rpm: 4.20.1 -> 6.0.2
- - -
-
-
-
2026-08-16
Gavini, Sumanth
Changes Requested
[v15,10/12] libarchive: Disable RPM filter auto-bidding and update huge_rpm test
rpm: 4.20.1 -> 6.0.2
- - -
-
-
-
2026-08-16
Gavini, Sumanth
Changes Requested
[v15,09/12] libarchive: Add RPM format reader to support rpm 6
rpm: 4.20.1 -> 6.0.2
- - -
-
-
-
2026-08-16
Gavini, Sumanth
Changes Requested
[v15,08/12] rpm: Fix pkgconfig() Provides missing in cross-built RPMs
rpm: 4.20.1 -> 6.0.2
- - -
-
-
-
2026-08-16
Gavini, Sumanth
Changes Requested
[v15,07/12] libarchive: Make it work with rpm 6.0.2
rpm: 4.20.1 -> 6.0.2
- - -
-
-
-
2026-08-16
Gavini, Sumanth
Changes Requested
[v15,06/12] rpm: 4.20.1 -> 6.0.2
rpm: 4.20.1 -> 6.0.2
- - -
-
-
-
2026-08-16
Gavini, Sumanth
Changes Requested
[v15,05/12] target-sdk-provides-dummy: Add pkg-config to DUMMYPROVIDES
rpm: 4.20.1 -> 6.0.2
- - -
-
-
-
2026-08-16
Gavini, Sumanth
Changes Requested
[v15,04/12] lib/oe/package.py: Don't redirect stderr
rpm: 4.20.1 -> 6.0.2
- - -
-
-
-
2026-08-16
Gavini, Sumanth
Changes Requested
[v15,03/12] lib/oe/package.py: Don't add ldconfig_postinst_fragment for glibc or musl
rpm: 4.20.1 -> 6.0.2
- - -
-
-
-
2026-08-16
Gavini, Sumanth
Changes Requested
[v15,02/12] package_rpm.bbclass: Define _lib and _libdir for rpmbuild
rpm: 4.20.1 -> 6.0.2
- - -
-
-
-
2026-08-16
Gavini, Sumanth
Changes Requested
[v15,01/12] package_rpm.bbclass: Drop external dependency generator to support rpm 6
rpm: 4.20.1 -> 6.0.2
- - -
-
-
-
2026-08-16
Gavini, Sumanth
Changes Requested
[AUH] libical: upgrading to 4.0.5 SUCCEEDED
[AUH] libical: upgrading to 4.0.5 SUCCEEDED
- - -
-
-
-
2026-08-16
auh@yoctoproject.org
New
[AUH] diffoscope: upgrading to 328 FAILED
[AUH] diffoscope: upgrading to 328 FAILED
- - -
-
-
-
2026-08-15
auh@yoctoproject.org
New
[AUH] libpsl: upgrading to 0.23.3 SUCCEEDED
[AUH] libpsl: upgrading to 0.23.3 SUCCEEDED
- - -
-
-
-
2026-08-15
auh@yoctoproject.org
New
[AUH] python3-hypothesis: upgrading to 6.165.9 FAILED
[AUH] python3-hypothesis: upgrading to 6.165.9 FAILED
- - -
-
-
-
2026-08-15
auh@yoctoproject.org
New
[AUH] python3-uv-build: upgrading to 0.12.5 FAILED
[AUH] python3-uv-build: upgrading to 0.12.5 FAILED
- - -
-
-
-
2026-08-15
auh@yoctoproject.org
New
[1/4] scripts: scriptutils: Use LicenseRef-Proprietary LICENSE while fetching
devtool: standard: Fix file copy on finish --force
- - -
-
-
-
2026-08-14
Mathieu Dubois-Briand
Changes Requested
[3/3] python3-hypothesis: upgrade 6.165.2 -> 6.165.6
python packages upgrade
- - -
-
-
-
2026-08-14
Jaipaul Cheernam
Superseded
[2/3] python3-uv-build: upgrade 0.12.3 -> 0.12.4
python packages upgrade
- - -
-
-
-
2026-08-14
Jaipaul Cheernam
Superseded
openssl: use nonarch_libdir for openssldir
openssl: use nonarch_libdir for openssldir
- - -
-
-
-
2026-08-14
정재윤/Task Leader/SW Platform(연)선행Platform개발실 Lightweight System Task
Changes Requested
[4/4] kernel-devsrc: copy kernel/sched/ext directory
Fixes for kernel 7.2
- - -
-
-
-
2026-08-14
Mikko Rapeli
Superseded
[1/4] lttng-modules: update from 2.15.2 to 2.16.0-rc2
Fixes for kernel 7.2
- - -
-
-
-
2026-08-14
Mikko Rapeli
Superseded
[AUH] bash-completion: upgrading to 2.18.0 SUCCEEDED
[AUH] bash-completion: upgrading to 2.18.0 SUCCEEDED
- - -
-
-
-
2026-08-14
auh@yoctoproject.org
New
[AUH] libgit2: upgrading to 1.9.7 SUCCEEDED
[AUH] libgit2: upgrading to 1.9.7 SUCCEEDED
- - -
-
-
-
2026-08-14
auh@yoctoproject.org
New
[AUH] python3-hypothesis: upgrading to 6.165.6 FAILED
[AUH] python3-hypothesis: upgrading to 6.165.6 FAILED
- - -
-
-
-
2026-08-14
auh@yoctoproject.org
New
[AUH] python3-uv-build: upgrading to 0.12.4 FAILED
[AUH] python3-uv-build: upgrading to 0.12.4 FAILED
- - -
-
-
-
2026-08-14
auh@yoctoproject.org
New
[AUH] python3-pbr: upgrading to 7.1.0 FAILED
[AUH] python3-pbr: upgrading to 7.1.0 FAILED
- - -
-
-
-
2026-08-14
auh@yoctoproject.org
New
[AUH] findutils: upgrading to 4.11.0 SUCCEEDED
[AUH] findutils: upgrading to 4.11.0 SUCCEEDED
- - -
-
-
-
2026-08-14
auh@yoctoproject.org
New
[AUH] epiphany: upgrading to 50.6 FAILED
[AUH] epiphany: upgrading to 50.6 FAILED
- - -
-
-
-
2026-08-14
auh@yoctoproject.org
New
[AUH] go-binary-native: upgrading to 1.26.6 SUCCEEDED
[AUH] go-binary-native: upgrading to 1.26.6 SUCCEEDED
- - -
-
-
-
2026-08-14
auh@yoctoproject.org
New
[7/7] kea: fix build with OpenSSL 4.0
openssl: upgrade to 4.0.1 and fix dependent recipes
- - -
-
-
-
2026-08-14
Jaipaul Cheernam
RFC
[6/7] u-boot-tools: fix build with OpenSSL 4.0
openssl: upgrade to 4.0.1 and fix dependent recipes
- - -
-
-
-
2026-08-14
Jaipaul Cheernam
RFC
[5/7] serf: fix build with OpenSSL 4.0
openssl: upgrade to 4.0.1 and fix dependent recipes
- - -
-
-
-
2026-08-14
Jaipaul Cheernam
RFC
[3/7] socat: fix build with OpenSSL 4.0
openssl: upgrade to 4.0.1 and fix dependent recipes
- - -
-
-
-
2026-08-14
Jaipaul Cheernam
RFC
[2/7] python3: backport OpenSSL 4.0 support from upstream
openssl: upgrade to 4.0.1 and fix dependent recipes
- - -
-
-
-
2026-08-14
Jaipaul Cheernam
RFC
[1/7] openssl: upgrade 3.5.7 -> 4.0.1
openssl: upgrade to 4.0.1 and fix dependent recipes
- - -
-
-
-
2026-08-14
Jaipaul Cheernam
RFC
wpa-supplicant: upgrade 2.11 to 2.12
wpa-supplicant: upgrade 2.11 to 2.12
- - -
-
-
-
2026-08-14
Hangtian Zhu
Superseded
[v3] kernel.bbclass: add strip process for signed kernel modules
[v3] kernel.bbclass: add strip process for signed kernel modules
- - -
-
-
-
2026-08-13
Bougrine Anis
Changes Requested
[v2] kernel.bbclass: add strip process for signed kernel modules
[v2] kernel.bbclass: add strip process for signed kernel modules
- - -
-
-
-
2026-08-13
Bougrine Anis
Changes Requested
[AUH] harfbuzz: upgrading to 14.3.1 SUCCEEDED
[AUH] harfbuzz: upgrading to 14.3.1 SUCCEEDED
- - -
-
-
-
2026-08-13
auh@yoctoproject.org
New
[AUH] boost-build-native: upgrading to 1.92.0 SUCCEEDED
[AUH] boost-build-native: upgrading to 1.92.0 SUCCEEDED
- - -
-
-
-
2026-08-13
auh@yoctoproject.org
New
[AUH] appstream: upgrading to 1.1.6 SUCCEEDED
[AUH] appstream: upgrading to 1.1.6 SUCCEEDED
- - -
-
-
-
2026-08-13
auh@yoctoproject.org
New
[AUH] gdk-pixbuf: upgrading to 2.44.8 SUCCEEDED
[AUH] gdk-pixbuf: upgrading to 2.44.8 SUCCEEDED
- - -
-
-
-
2026-08-13
auh@yoctoproject.org
New
[AUH] boost: upgrading to 1.92.0 FAILED
[AUH] boost: upgrading to 1.92.0 FAILED
- - -
-
-
-
2026-08-13
auh@yoctoproject.org
New
[AUH] python3-hypothesis: upgrading to 6.165.5 FAILED
[AUH] python3-hypothesis: upgrading to 6.165.5 FAILED
- - -
-
-
-
2026-08-13
auh@yoctoproject.org
New
[AUH] procps: upgrading to 4.0.7 FAILED
[AUH] procps: upgrading to 4.0.7 FAILED
- - -
-
-
-
2026-08-13
auh@yoctoproject.org
New
[AUH] rsync: upgrading to 3.5.0 SUCCEEDED
[AUH] rsync: upgrading to 3.5.0 SUCCEEDED
- - -
-
-
-
2026-08-13
auh@yoctoproject.org
New
[v2,2/2] oeqa/sdk: build the kernel's host tools with a host pkg-config
fix the SDK kernel module test
- - -
-
-
-
2026-08-13
Trevor Woerner
Changes Requested
[v2,1/2] oeqa/sdk: update cryptodev to a revision that builds on kernel 6.18
fix the SDK kernel module test
- - -
-
-
-
2026-08-13
Trevor Woerner
Changes Requested
[v14,10/10] libarchive: Disable RPM filter auto-bidding and update huge_rpm test
rpm: 4.20.1 -> 6.0.2
- - -
-
-
-
2026-08-12
Gavini, Sumanth
Superseded
[v14,09/10] libarchive: Add RPM format reader to support rpm 6
rpm: 4.20.1 -> 6.0.2
- - -
-
-
-
2026-08-12
Gavini, Sumanth
Superseded
[v14,08/10] rpm: Fix pkgconfig() Provides missing in cross-built RPMs
rpm: 4.20.1 -> 6.0.2
- - -
-
-
-
2026-08-12
Gavini, Sumanth
Superseded
[v14,07/10] libarchive: Make it work with rpm 6.0.2
rpm: 4.20.1 -> 6.0.2
- - -
-
-
-
2026-08-12
Gavini, Sumanth
Superseded
[v14,06/10] rpm: 4.20.1 -> 6.0.2
rpm: 4.20.1 -> 6.0.2
- - -
-
-
-
2026-08-12
Gavini, Sumanth
Superseded
[v14,05/10] target-sdk-provides-dummy: Add pkg-config to DUMMYPROVIDES
rpm: 4.20.1 -> 6.0.2
- - -
-
-
-
2026-08-12
Gavini, Sumanth
Superseded
[v14,04/10] lib/oe/package.py: Don't redirect stderr
rpm: 4.20.1 -> 6.0.2
- - -
-
-
-
2026-08-12
Gavini, Sumanth
Superseded
[v14,03/10] lib/oe/package.py: Don't add ldconfig_postinst_fragment for glibc or musl
rpm: 4.20.1 -> 6.0.2
- - -
-
-
-
2026-08-12
Gavini, Sumanth
Superseded
[v14,02/10] package_rpm.bbclass: Define _lib and _libdir for rpmbuild
rpm: 4.20.1 -> 6.0.2
- - -
-
-
-
2026-08-12
Gavini, Sumanth
Superseded
[v14,01/10] package_rpm.bbclass: Drop external dependency generator to support rpm 6
rpm: 4.20.1 -> 6.0.2
- - -
-
-
-
2026-08-12
Gavini, Sumanth
Superseded
«
1
2
...
7
8
9
…
172
173
»