Show patches with: Archived = No       |   17245 patches
« 1 2 ... 6 7 8 … 172 173 »
Patch Series A/R/T S/W/F Date Submitter Delegate State
[17/17] sbom-cve-check-update-nvd-native,sbom-cve-check-update-cvelist-native: upgrade 2026.08.03-0… [01/17] gst-devtools: upgrade 1.28.5 -> 1.28.6 - - - --- 2026-08-26 Wang Mingyu Under Review
[15/17] python3-shacl2code: upgrade 1.1.0 -> 1.2.0 [01/17] gst-devtools: upgrade 1.28.5 -> 1.28.6 - - - --- 2026-08-26 Wang Mingyu Superseded
[14/17] python3-pbr: upgrade 7.1.0 -> 7.1.1 [01/17] gst-devtools: upgrade 1.28.5 -> 1.28.6 - - - --- 2026-08-26 Wang Mingyu Accepted
[scarthgap,11/11] u-boot-tools: Ignore CVE-2026-29009 u-boot-tools: address multiple CVEs - - - --- 2026-08-26 Hetvi Thakar -X (hthakar - E INFOCHIPS PRIVATE LIMITED at Cisco) ycongal_smile Changes Requested
[scarthgap,10/11] u-boot-tools: Ignore CVE-2026-29008 u-boot-tools: address multiple CVEs - - - --- 2026-08-26 Hetvi Thakar -X (hthakar - E INFOCHIPS PRIVATE LIMITED at Cisco) ycongal_smile Changes Requested
[scarthgap,09/11] u-boot-tools: Ignore CVE-2026-29007 u-boot-tools: address multiple CVEs - - - --- 2026-08-26 Hetvi Thakar -X (hthakar - E INFOCHIPS PRIVATE LIMITED at Cisco) ycongal_smile Changes Requested
[scarthgap,08/11] u-boot-tools: Ignore CVE-2024-57259 u-boot-tools: address multiple CVEs - - - --- 2026-08-26 Hetvi Thakar -X (hthakar - E INFOCHIPS PRIVATE LIMITED at Cisco) ycongal_smile Changes Requested
[scarthgap,07/11] u-boot-tools: Ignore CVE-2024-57258 u-boot-tools: address multiple CVEs - - - --- 2026-08-26 Hetvi Thakar -X (hthakar - E INFOCHIPS PRIVATE LIMITED at Cisco) ycongal_smile Changes Requested
[scarthgap,06/11] u-boot-tools: Ignore CVE-2024-57257 u-boot-tools: address multiple CVEs - - - --- 2026-08-26 Hetvi Thakar -X (hthakar - E INFOCHIPS PRIVATE LIMITED at Cisco) ycongal_smile Changes Requested
[scarthgap,05/11] u-boot-tools: Ignore CVE-2024-57256 u-boot-tools: address multiple CVEs - - - --- 2026-08-26 Hetvi Thakar -X (hthakar - E INFOCHIPS PRIVATE LIMITED at Cisco) ycongal_smile Changes Requested
[scarthgap,04/11] u-boot-tools: Ignore CVE-2024-57255 u-boot-tools: address multiple CVEs - - - --- 2026-08-26 Hetvi Thakar -X (hthakar - E INFOCHIPS PRIVATE LIMITED at Cisco) ycongal_smile Changes Requested
[scarthgap,03/11] u-boot-tools: Ignore CVE-2024-57254 u-boot-tools: address multiple CVEs - - - --- 2026-08-26 Hetvi Thakar -X (hthakar - E INFOCHIPS PRIVATE LIMITED at Cisco) ycongal_smile Changes Requested
[scarthgap,02/11] u-boot-tools: Ignore CVE-2024-42040 u-boot-tools: address multiple CVEs - - - --- 2026-08-26 Hetvi Thakar -X (hthakar - E INFOCHIPS PRIVATE LIMITED at Cisco) ycongal_smile Changes Requested
perl: correct CVE_PRODUCT mapping perl: correct CVE_PRODUCT mapping - - - --- 2026-08-26 Devansh Patel -X (devanshp - E INFOCHIPS PRIVATE LIMITED at Cisco) Changes Requested
python3: correct CVE_PRODUCT mapping python3: correct CVE_PRODUCT mapping - - - --- 2026-08-26 Devansh Patel -X (devanshp - E INFOCHIPS PRIVATE LIMITED at Cisco) Changes Requested
nghttp2: correct CVE_PRODUCT mapping nghttp2: correct CVE_PRODUCT mapping - - - --- 2026-08-26 Devansh Patel -X (devanshp - E INFOCHIPS PRIVATE LIMITED at Cisco) Changes Requested
libssh2: correct CVE_PRODUCT mapping libssh2: correct CVE_PRODUCT mapping - - - --- 2026-08-26 Devansh Patel -X (devanshp - E INFOCHIPS PRIVATE LIMITED at Cisco) Changes Requested
libxml2: correct CVE_PRODUCT mapping libxml2: correct CVE_PRODUCT mapping - - - --- 2026-08-26 Devansh Patel -X (devanshp - E INFOCHIPS PRIVATE LIMITED at Cisco) Changes Requested
[AUH] python3-uv-build: upgrading to 0.12.6 SUCCEEDED [AUH] python3-uv-build: upgrading to 0.12.6 SUCCEEDED - - - --- 2026-08-26 auh@yoctoproject.org New
[AUH] python3-git: upgrading to 3.1.60 SUCCEEDED [AUH] python3-git: upgrading to 3.1.60 SUCCEEDED - - - --- 2026-08-26 auh@yoctoproject.org Under Review
[AUH] python3-pbr: upgrading to 7.1.2 SUCCEEDED [AUH] python3-pbr: upgrading to 7.1.2 SUCCEEDED - - - --- 2026-08-26 auh@yoctoproject.org Under Review
[AUH] python3-cryptography-vectors,python3-cryptography: upgrading to 50.0.1,50.0.1 SUCCEEDED [AUH] python3-cryptography-vectors,python3-cryptography: upgrading to 50.0.1,50.0.1 SUCCEEDED - - - --- 2026-08-26 auh@yoctoproject.org New
[AUH] libslirp: upgrading to 4.9.4 SUCCEEDED [AUH] libslirp: upgrading to 4.9.4 SUCCEEDED - - - --- 2026-08-26 auh@yoctoproject.org New
[AUH] cmake,cmake-native: upgrading to 4.4.3,4.4.3 SUCCEEDED [AUH] cmake,cmake-native: upgrading to 4.4.3,4.4.3 SUCCEEDED - - - --- 2026-08-26 auh@yoctoproject.org New
[1/2] python3-pbr: upgrade 7.1.0 -> 7.1.1 python3-pbr: upgrade 7.1.0 -> 7.1.1 - - - --- 2026-08-26 Mathieu Dubois-Briand Accepted
[scarthgap] vim: Fix CVE-2026-28417 regressions [scarthgap] vim: Fix CVE-2026-28417 regressions - - - --- 2026-08-26 Devansh Patel -X (devanshp - E INFOCHIPS PRIVATE LIMITED at Cisco) ycongal_smile Under Review
[v5,5/5] documentation.conf: add documentation for KERNEL_MODULE_INSTALL_PREFIX variable Make signed kernel modules stripped - - - --- 2026-08-25 Bougrine Anis Changes Requested
[v5,4/5] kernel: centralize kernel module installation path in one variable Make signed kernel modules stripped - - - --- 2026-08-25 Bougrine Anis Changes Requested
[v5,3/5] package.py: remove stripping and splitting skip for signed kernel modules Make signed kernel modules stripped - - - --- 2026-08-25 Bougrine Anis Changes Requested
[v5,2/5] kernel: re-sign kernel modules after package stripping process Make signed kernel modules stripped - - - --- 2026-08-25 Bougrine Anis Changes Requested
[v5,1/5] kernel-module-split.bbclass: add get_ext_mod function for module signing Make signed kernel modules stripped - - - --- 2026-08-25 Bougrine Anis Changes Requested
[2/2] busybox: Remove CONFIG_SHA1_SMALL and CONFIG_SHA*_HWACCEL from sha*sum.cfg [1/2] Revert "busybox: Make provisions to disable sha256/sha1 accelaration on x86" - - - --- 2026-08-25 Peter Kjellerstedt Changes Requested
[1/2] Revert "busybox: Make provisions to disable sha256/sha1 accelaration on x86" [1/2] Revert "busybox: Make provisions to disable sha256/sha1 accelaration on x86" - - - --- 2026-08-25 Peter Kjellerstedt Changes Requested
[2/2] archiver.bbclass: Add ARCHIVER_MIRROR_INCLUDE [1/2] archiver.bbclass: Improve the indentation of the documentation - - - --- 2026-08-25 Peter Kjellerstedt Changes Requested
[1/2] archiver.bbclass: Improve the indentation of the documentation [1/2] archiver.bbclass: Improve the indentation of the documentation - - - --- 2026-08-25 Peter Kjellerstedt Changes Requested
spdx30_tasks: Fix duplicated revision in Git PURLs spdx30_tasks: Fix duplicated revision in Git PURLs - 1 - --- 2026-08-25 KAZUYOSHI AKIYAMA (秋山 和慶) Under Review
[AUH] python3-maturin: upgrading to 1.15.0 SUCCEEDED [AUH] python3-maturin: upgrading to 1.15.0 SUCCEEDED - - - --- 2026-08-25 auh@yoctoproject.org New
[AUH] python3-pbr: upgrading to 7.1.1 SUCCEEDED [AUH] python3-pbr: upgrading to 7.1.1 SUCCEEDED - - - --- 2026-08-25 auh@yoctoproject.org New
[AUH] netbase: upgrading to 6.6 FAILED [AUH] netbase: upgrading to 6.6 FAILED - - - --- 2026-08-25 auh@yoctoproject.org New
[AUH] barebox-tools: upgrading to 2026.08.0 SUCCEEDED [AUH] barebox-tools: upgrading to 2026.08.0 SUCCEEDED - - - --- 2026-08-25 auh@yoctoproject.org New
[AUH] python3-imagesize: upgrading to 2.0.1 FAILED [AUH] python3-imagesize: upgrading to 2.0.1 FAILED - - - --- 2026-08-25 auh@yoctoproject.org New
[scarthgap] boost: make ICU support configurable [scarthgap] boost: make ICU support configurable - - - --- 2026-08-25 Shinu Chandran ycongal_smile Under Review
[v17,14/14] lib/oe/package_manager/rpm: handle RPM 6 non-zero exit on %post failure rpm: 4.20.1 -> 6.0.2 - - - --- 2026-08-25 Gavini, Sumanth Superseded
[v17,13/14] package_rpm.bbclass: suppress RPM 6 fileattr dependency generators rpm: 4.20.1 -> 6.0.2 - - - --- 2026-08-25 Gavini, Sumanth Superseded
[v17,12/14] lib/oe/package_manager/rpm: Enable DNF filelists to resolve file deps rpm: 4.20.1 -> 6.0.2 - - - --- 2026-08-25 Gavini, Sumanth Superseded
[v17,11/14] package_rpm.bbclass: Suppress pkgconfig() Requires for sstate compatibility rpm: 4.20.1 -> 6.0.2 - - - --- 2026-08-25 Gavini, Sumanth Superseded
[v17,10/14] libarchive: Disable RPM filter auto-bidding and update huge_rpm test rpm: 4.20.1 -> 6.0.2 - - - --- 2026-08-25 Gavini, Sumanth Superseded
[v17,09/14] libarchive: Add RPM format reader to support rpm 6 rpm: 4.20.1 -> 6.0.2 - - - --- 2026-08-25 Gavini, Sumanth Superseded
[v17,08/14] rpm: Fix pkgconfig() Provides missing in cross-built RPMs rpm: 4.20.1 -> 6.0.2 - - - --- 2026-08-25 Gavini, Sumanth Superseded
[v17,07/14] libarchive: Make it work with rpm 6.0.2 rpm: 4.20.1 -> 6.0.2 - - - --- 2026-08-25 Gavini, Sumanth Superseded
[v17,06/14] rpm: 4.20.1 -> 6.0.2 rpm: 4.20.1 -> 6.0.2 - - - --- 2026-08-25 Gavini, Sumanth Superseded
[v17,05/14] target-sdk-provides-dummy: Add pkg-config to DUMMYPROVIDES rpm: 4.20.1 -> 6.0.2 - - - --- 2026-08-25 Gavini, Sumanth Superseded
[v17,04/14] lib/oe/package.py: Don't redirect stderr rpm: 4.20.1 -> 6.0.2 - - - --- 2026-08-25 Gavini, Sumanth Superseded
[v17,03/14] lib/oe/package.py: Don't add ldconfig_postinst_fragment for glibc or musl rpm: 4.20.1 -> 6.0.2 - - - --- 2026-08-25 Gavini, Sumanth Superseded
[v17,02/14] package_rpm.bbclass: Define _lib and _libdir for rpmbuild rpm: 4.20.1 -> 6.0.2 - - - --- 2026-08-25 Gavini, Sumanth Superseded
[v17,01/14] package_rpm.bbclass: Drop external dependency generator to support rpm 6 rpm: 4.20.1 -> 6.0.2 - - - --- 2026-08-25 Gavini, Sumanth Superseded
[v16,14/14] lib/oe/package_manager/rpm: handle RPM 6 non-zero exit rpm: 4.20.1 -> 6.0.2 - - - --- 2026-08-25 Gavini, Sumanth Superseded
[v16,13/14] package_rpm.bbclass: suppress RPM 6 fileattr dependency generators rpm: 4.20.1 -> 6.0.2 - - - --- 2026-08-25 Gavini, Sumanth Superseded
[v16,12/14] lib/oe/package_manager/rpm: Enable DNF filelists to resolve file deps rpm: 4.20.1 -> 6.0.2 - - - --- 2026-08-25 Gavini, Sumanth Superseded
[v16,11/14] package_rpm.bbclass: Suppress pkgconfig() Requires for sstate compatibility rpm: 4.20.1 -> 6.0.2 - - - --- 2026-08-25 Gavini, Sumanth Superseded
[v16,10/14] libarchive: Disable RPM filter auto-bidding and update huge_rpm test rpm: 4.20.1 -> 6.0.2 - - - --- 2026-08-25 Gavini, Sumanth Superseded
[v16,09/14] libarchive: Add RPM format reader to support rpm 6 rpm: 4.20.1 -> 6.0.2 - - - --- 2026-08-25 Gavini, Sumanth Superseded
[v16,08/14] rpm: Fix pkgconfig() Provides missing in cross-built RPMs rpm: 4.20.1 -> 6.0.2 - - - --- 2026-08-25 Gavini, Sumanth Superseded
[v16,07/14] libarchive: Make it work with rpm 6.0.2 rpm: 4.20.1 -> 6.0.2 - - - --- 2026-08-25 Gavini, Sumanth Superseded
[v16,06/14] rpm: 4.20.1 -> 6.0.2 rpm: 4.20.1 -> 6.0.2 - - - --- 2026-08-25 Gavini, Sumanth Superseded
[v16,05/14] target-sdk-provides-dummy: Add pkg-config to DUMMYPROVIDES rpm: 4.20.1 -> 6.0.2 - - - --- 2026-08-25 Gavini, Sumanth Superseded
[v16,04/14] lib/oe/package.py: Don't redirect stderr rpm: 4.20.1 -> 6.0.2 - - - --- 2026-08-25 Gavini, Sumanth Superseded
[v16,03/14] lib/oe/package.py: Don't add ldconfig_postinst_fragment for glibc or musl rpm: 4.20.1 -> 6.0.2 - - - --- 2026-08-25 Gavini, Sumanth Superseded
[v16,02/14] package_rpm.bbclass: Define _lib and _libdir for rpmbuild rpm: 4.20.1 -> 6.0.2 - - - --- 2026-08-25 Gavini, Sumanth Superseded
[v16,01/14] package_rpm.bbclass: Drop external dependency generator to support rpm 6 rpm: 4.20.1 -> 6.0.2 - - - --- 2026-08-25 Gavini, Sumanth Superseded
[v2] rust: Avoid passing host-specific information to crates Strict Version Hash [v2] rust: Avoid passing host-specific information to crates Strict Version Hash - - - --- 2026-08-24 Alejandro Hernandez Changes Requested
[v2] sbom30.py/spdx30_tasks.py: fix SPDX_* prefix lookup [v2] sbom30.py/spdx30_tasks.py: fix SPDX_* prefix lookup - - - --- 2026-08-24 iwanicki92 Changes Requested
[3/3] expat: fix CVE-2026-56412 [1/3] expat: fix CVE-2026-50219 - - - --- 2026-08-24 Jakub Szczudlo (Nokia) Changes Requested
[2/3] expat: fix CVE-2026-56131 [1/3] expat: fix CVE-2026-50219 - - - --- 2026-08-24 Jakub Szczudlo (Nokia) Changes Requested
[1/3] expat: fix CVE-2026-50219 [1/3] expat: fix CVE-2026-50219 - - - --- 2026-08-24 Jakub Szczudlo (Nokia) Changes Requested
[v3] bitbake.conf: Extend distro feature usrmerge to merge bin+sbin [v3] bitbake.conf: Extend distro feature usrmerge to merge bin+sbin - - - --- 2026-08-24 Jörg Sommer Changes Requested
[v2] kernel-fit-image: Don't add hash node when signing is enabled [v2] kernel-fit-image: Don't add hash node when signing is enabled - - - --- 2026-08-24 Jonas Juffinger via B4 Relay Under Review
u-boot-tools: add CVE_PRODUCT mapping u-boot-tools: add CVE_PRODUCT mapping - - - --- 2026-08-24 Devansh Patel -X (devanshp - E INFOCHIPS PRIVATE LIMITED at Cisco) Changes Requested
glib-2.0: correct CVE_PRODUCT mapping glib-2.0: correct CVE_PRODUCT mapping - - - --- 2026-08-24 Devansh Patel -X (devanshp - E INFOCHIPS PRIVATE LIMITED at Cisco) Changes Requested
avahi: correct CVE_PRODUCT mapping avahi: correct CVE_PRODUCT mapping - - - --- 2026-08-24 Devansh Patel -X (devanshp - E INFOCHIPS PRIVATE LIMITED at Cisco) Changes Requested
binutils: correct CVE_PRODUCT mapping binutils: correct CVE_PRODUCT mapping - - - --- 2026-08-24 Devansh Patel -X (devanshp - E INFOCHIPS PRIVATE LIMITED at Cisco) Changes Requested
expat: correct CVE_PRODUCT mapping expat: correct CVE_PRODUCT mapping - - - --- 2026-08-24 Devansh Patel -X (devanshp - E INFOCHIPS PRIVATE LIMITED at Cisco) Changes Requested
[AUH] ccache: upgrading to 4.14 SUCCEEDED [AUH] ccache: upgrading to 4.14 SUCCEEDED - - - --- 2026-08-24 auh@yoctoproject.org New
[AUH] utfcpp: upgrading to 4.2.0 SUCCEEDED [AUH] utfcpp: upgrading to 4.2.0 SUCCEEDED - - - --- 2026-08-24 auh@yoctoproject.org New
[AUH] pkgconf: upgrading to 3.0.6 SUCCEEDED [AUH] pkgconf: upgrading to 3.0.6 SUCCEEDED - - - --- 2026-08-24 auh@yoctoproject.org New
[AUH] python3-cython: upgrading to 3.3.0 SUCCEEDED [AUH] python3-cython: upgrading to 3.3.0 SUCCEEDED - - - --- 2026-08-23 auh@yoctoproject.org New
sbom30.py/spdx30_tasks.py: fix SPDX_* prefix lookup sbom30.py/spdx30_tasks.py: fix SPDX_* prefix lookup - - - --- 2026-08-22 iwanicki92 Changes Requested
[v2] classes: spdx-3.0: add missing vardeps [v2] classes: spdx-3.0: add missing vardeps - - - --- 2026-08-22 iwanicki92 Rejected
[RFC,v4,1/6] openssl: upgrade 3.5.7 -> 4.0.1 openssl: upgrade 3.5.7 -> 4.0.1 - - - --- 2026-08-22 Jaipaul Cheernam RFC
classes: spdx-3.0: add missing vardeps classes: spdx-3.0: add missing vardeps - - - --- 2026-08-22 iwanicki92 Superseded
[RFC,v3,1/6] openssl: upgrade 3.5.7 -> 4.0.1 openssl: upgrade 3.5.7 -> 4.0.1 - - - --- 2026-08-22 Jaipaul Cheernam Superseded
[AUH] diffoscope: upgrading to 329 SUCCEEDED [AUH] diffoscope: upgrading to 329 SUCCEEDED - - - --- 2026-08-22 auh@yoctoproject.org New
[AUH] python3-sphinx-argparse: upgrading to 0.6.1 SUCCEEDED [AUH] python3-sphinx-argparse: upgrading to 0.6.1 SUCCEEDED - - - --- 2026-08-22 auh@yoctoproject.org New
[AUH] ed: upgrading to 1.22.6 SUCCEEDED [AUH] ed: upgrading to 1.22.6 SUCCEEDED - - - --- 2026-08-22 auh@yoctoproject.org New
[v4,4/4] documentation.conf: add documentation for MOD_INSTALL_PREFIX variable Make signed kernel modules stripped - - - --- 2026-08-22 Bougrine Anis Superseded
[v4,3/4] kernel: centralize kernel module installation path in one variable Make signed kernel modules stripped - - - --- 2026-08-22 Bougrine Anis Superseded
[v4,2/4] package.py: remove stripping and splitting skip for signed kernel modules Make signed kernel modules stripped - - - --- 2026-08-22 Bougrine Anis Superseded
[v4,1/4] kernel.bbclass: re-sign kernel modules after package stripping process Make signed kernel modules stripped - - - --- 2026-08-22 Bougrine Anis Superseded
[meta-yocto-bsp,06/06] linux-yocto/6.18: update to v6.18.44 kernel-yocto: 6.18 and 7.2 RFC/prep - - - --- 2026-08-21 Bruce Ashfield Under Review
[meta,05/06] kernel-devsrc: copy arch/x86 vdso2c sources for on-target prepare kernel-yocto: 6.18 and 7.2 RFC/prep - - - --- 2026-08-21 Bruce Ashfield Accepted
« 1 2 ... 6 7 8 … 172 173 »