Show patches with: Archived = No       |   17278 patches
« 1 2 3 4 … 172 173 »
Patch Series A/R/T S/W/F Date Submitter Delegate State
[v2,1/1] recipes-support/gnutls: disable slow tests for RISCV64 recipes-support/gnutls: disable slow tests for RISCV64 - - - --- 2026-09-28 Joao Marcos Costa Changes Requested
[v2] libpcap: add ptest support [v2] libpcap: add ptest support - - - --- 2026-09-28 Pratik Farkase Under Review
libpcap: add ptest support libpcap: add ptest support - - - --- 2026-09-28 Pratik Farkase Under Review
[wrynose,2/2] tzdata/tzcode-native: upgrade 2026c -> 2026d [wrynose,1/2] tzcode/tzdata: fix upstream version check - - - --- 2026-09-28 Vijay Anusuri ycongal_smile New
[wrynose,1/2] tzcode/tzdata: fix upstream version check [wrynose,1/2] tzcode/tzdata: fix upstream version check - - - --- 2026-09-28 Vijay Anusuri ycongal_smile New
[1/3] systemd: Upgrade 261.3 -> 262 systemd: Upgrade 261.3 -> 262 - - - --- 2026-09-28 Jaipaul Cheernam Changes Requested
avahi: add ptest support avahi: add ptest support - - - --- 2026-09-28 Pratik Farkase Under Review
[wrynose] qemuriscv.inc: default to fw_dynamic.elf as QEMU BIOS [wrynose] qemuriscv.inc: default to fw_dynamic.elf as QEMU BIOS - - - --- 2026-09-28 Harish Sadineni ycongal_smile New
linux-firmware: package qcom-shikra-wifi firmware linux-firmware: package qcom-shikra-wifi firmware - - - --- 2026-09-28 Viswanath Kraleti Changes Requested
libpwquality: Add version tag for SRC_URI libpwquality: Add version tag for SRC_URI - - - --- 2026-09-28 Jaipaul Cheernam Rejected
[scarthgap,6/6] bind: fix for CVE-2026-13204, CVE-2026-13321 [scarthgap,1/6] bind: fix for CVE-2026-10723 - - - --- 2026-09-28 Hitendra Prajapati ycongal_smile Changes Requested
[scarthgap,5/6] bind: fix for CVE-2026-12617 [scarthgap,1/6] bind: fix for CVE-2026-10723 - - - --- 2026-09-28 Hitendra Prajapati ycongal_smile Changes Requested
[scarthgap,4/6] bind: fix for CVE-2026-11622, CVE-2026-11721 [scarthgap,1/6] bind: fix for CVE-2026-10723 - - - --- 2026-09-28 Hitendra Prajapati ycongal_smile Changes Requested
[scarthgap,3/6] bind: fix for CVE-2026-11331 [scarthgap,1/6] bind: fix for CVE-2026-10723 - - - --- 2026-09-28 Hitendra Prajapati ycongal_smile Changes Requested
[scarthgap,2/6] bind: fix for CVE-2026-10822 [scarthgap,1/6] bind: fix for CVE-2026-10723 - - - --- 2026-09-28 Hitendra Prajapati ycongal_smile Changes Requested
[scarthgap,1/6] bind: fix for CVE-2026-10723 [scarthgap,1/6] bind: fix for CVE-2026-10723 - - - --- 2026-09-28 Hitendra Prajapati ycongal_smile Changes Requested
[AUH] python3-hypothesis: upgrading to 6.168.2 SUCCEEDED [AUH] python3-hypothesis: upgrading to 6.168.2 SUCCEEDED - - - --- 2026-09-28 auh@yoctoproject.org Under Review
[AUH] dbus-glib: upgrading to 0.116 SUCCEEDED [AUH] dbus-glib: upgrading to 0.116 SUCCEEDED - - - --- 2026-09-28 auh@yoctoproject.org Under Review
[AUH] ccache: upgrading to 4.14.1 SUCCEEDED [AUH] ccache: upgrading to 4.14.1 SUCCEEDED - - - --- 2026-09-28 auh@yoctoproject.org Under Review
[1/2] elfutils: Fix backtrace ptests on musl [1/2] elfutils: Fix backtrace ptests on musl - - - --- 2026-09-28 Khem Raj Changes Requested
multilib: skip cross-canadian recipes when renaming package variables multilib: skip cross-canadian recipes when renaming package variables - - - --- 2026-09-28 mark.yang Under Review
[2/2] toolchain-scripts/meta-environment: use each variant's own site files [1/2] siteinfo: add siteinfo_get_files_for_machine() - - - --- 2026-09-28 mark.yang Under Review
[1/2] siteinfo: add siteinfo_get_files_for_machine() [1/2] siteinfo: add siteinfo_get_files_for_machine() - - - --- 2026-09-28 mark.yang Under Review
[5/5] oe-selftest: devtool ide-sdk: cover modified + shared + NFS devtool ide-sdk: support --modified and --shared modes - - - --- 2026-09-27 AdrianF Under Review
[4/5] devtool: ide-sdk: allow combining shared and modified modes devtool ide-sdk: support --modified and --shared modes - - - --- 2026-09-27 AdrianF Under Review
[3/5] devtool: ide-sdk: support NFS exports in shared mode devtool ide-sdk: support --modified and --shared modes - - - --- 2026-09-27 AdrianF Under Review
[2/5] devtool: ide-sdk: initialize shared images for IDE plugins devtool ide-sdk: support --modified and --shared modes - - - --- 2026-09-27 AdrianF Under Review
[1/5] devtool: ide-sdk: support shared recipe IDE hooks devtool ide-sdk: support --modified and --shared modes - - - --- 2026-09-27 AdrianF Under Review
[1/8] erofs-utils: Make reproducible for different BUILD_ARCH [1/8] erofs-utils: Make reproducible for different BUILD_ARCH - - - --- 2026-09-27 Richard Purdie Under Review
[wrynose,8/8] pulseaudio: set status for CVE-2020-15710 and CVE-2020-16123 [wrynose,1/8] glibc: set status for CVE-2011-0536 and CVE-2025-0577 - - - --- 2026-09-27 Marko, Peter ycongal_smile New
[wrynose,7/8] ppp: set status for CVE-2020-15704 [wrynose,1/8] glibc: set status for CVE-2011-0536 and CVE-2025-0577 - - - --- 2026-09-27 Marko, Peter ycongal_smile New
[wrynose,6/8] ovmf: set status of CVE-2017-5731 and CVE-2019-14584 [wrynose,1/8] glibc: set status for CVE-2011-0536 and CVE-2025-0577 - - - --- 2026-09-27 Marko, Peter ycongal_smile New
[wrynose,5/8] openssl: set status for CVE-2015-3216 [wrynose,1/8] glibc: set status for CVE-2011-0536 and CVE-2025-0577 - - - --- 2026-09-27 Marko, Peter ycongal_smile New
[wrynose,4/8] nfs-utils: set status for CVE-2025-12801 [wrynose,1/8] glibc: set status for CVE-2011-0536 and CVE-2025-0577 - - - --- 2026-09-27 Marko, Peter ycongal_smile New
[wrynose,3/8] libarchive: set status for CVE-2026-4424 [wrynose,1/8] glibc: set status for CVE-2011-0536 and CVE-2025-0577 - - - --- 2026-09-27 Marko, Peter ycongal_smile New
[wrynose,2/8] gnutls: set status for CVE-2023-0361 [wrynose,1/8] glibc: set status for CVE-2011-0536 and CVE-2025-0577 - - - --- 2026-09-27 Marko, Peter ycongal_smile New
[wrynose,1/8] glibc: set status for CVE-2011-0536 and CVE-2025-0577 [wrynose,1/8] glibc: set status for CVE-2011-0536 and CVE-2025-0577 - - - --- 2026-09-27 Marko, Peter ycongal_smile New
[AUH] gtk-doc: upgrading to 1.37.0 SUCCEEDED [AUH] gtk-doc: upgrading to 1.37.0 SUCCEEDED - - - --- 2026-09-27 auh@yoctoproject.org New
[AUH] python3-meson-python: upgrading to 0.22.0 SUCCEEDED [AUH] python3-meson-python: upgrading to 0.22.0 SUCCEEDED - - - --- 2026-09-27 auh@yoctoproject.org New
[PATCHv2] cpan: do not rebuild the Makefile when perls config is re-staged [PATCHv2] cpan: do not rebuild the Makefile when perls config is re-staged - - - --- 2026-09-26 Markus Volk Under Review
[AUH] diffoscope: upgrading to 331 SUCCEEDED [AUH] diffoscope: upgrading to 331 SUCCEEDED - - - --- 2026-09-26 auh@yoctoproject.org New
[AUH] python3-pbr: upgrading to 7.1.2 SUCCEEDED [AUH] python3-pbr: upgrading to 7.1.2 SUCCEEDED - - - --- 2026-09-26 auh@yoctoproject.org Under Review
[AUH] python3-markdown: upgrading to 3.11 SUCCEEDED [AUH] python3-markdown: upgrading to 3.11 SUCCEEDED - - - --- 2026-09-26 auh@yoctoproject.org New
compiler-rt: Use specific arm architecture instead of 'arm' compiler-rt: Use specific arm architecture instead of 'arm' - - - --- 2026-09-25 Jan Strater-Büddefeld Changes Requested
[v2,2/2] scripts/contrib: add spdx-release-date-report.py [v2,1/2] create-spdx-3.0: record component release date in SPDX output - - - --- 2026-09-25 Daniel Turull Changes Requested
[v2,1/2] create-spdx-3.0: record component release date in SPDX output [v2,1/2] create-spdx-3.0: record component release date in SPDX output - - - --- 2026-09-25 Daniel Turull Changes Requested
[v3] tiff: add ptest support [v3] tiff: add ptest support - - - --- 2026-09-25 Himani Ramesh Barde Changes Requested
[AUH] parted: upgrading to 3.8 SUCCEEDED [AUH] parted: upgrading to 3.8 SUCCEEDED - - - --- 2026-09-25 auh@yoctoproject.org New
[AUH] epiphany: upgrading to 51.1 SUCCEEDED [AUH] epiphany: upgrading to 51.1 SUCCEEDED - - - --- 2026-09-25 auh@yoctoproject.org New
[AUH] libuv: upgrading to 1.53.0 SUCCEEDED [AUH] libuv: upgrading to 1.53.0 SUCCEEDED - - - --- 2026-09-25 auh@yoctoproject.org New
[AUH] libpam: upgrading to 1.7.3 SUCCEEDED [AUH] libpam: upgrading to 1.7.3 SUCCEEDED - - - --- 2026-09-25 auh@yoctoproject.org New
[AUH] python3-uv-build: upgrading to 0.12.19 SUCCEEDED [AUH] python3-uv-build: upgrading to 0.12.19 SUCCEEDED - - - --- 2026-09-25 auh@yoctoproject.org New
libx11: stage the X11 locale data in the native sysroot libx11: stage the X11 locale data in the native sysroot - - - --- 2026-09-25 Markus Volk Under Review
[scarthgap,v2,2/2] python3-pyasn1: fix CVE-2026-59885 [OE-core[scarthgap,v2,1/2] python3-pyasn1: fix CVE-2026-30922 - - - --- 2026-09-24 Yogita Urade ycongal_smile Under Review
[OE-core[scarthgap,v2,1/2] python3-pyasn1: fix CVE-2026-30922 [OE-core[scarthgap,v2,1/2] python3-pyasn1: fix CVE-2026-30922 - - - --- 2026-09-24 Yogita Urade ycongal_smile Under Review
[v3] systemd: fix musl build by fixing limits.h override [v3] systemd: fix musl build by fixing limits.h override - - - --- 2026-09-24 Ross Burton Changes Requested
[scarthgap,v2] glibc: Fix CVE-2026-6238 [scarthgap,v2] glibc: Fix CVE-2026-6238 - - - --- 2026-09-24 Varatharajan, Deepesh ycongal_smile Under Review
remove fatal error when .crt file is missing at fitimage sanity check remove fatal error when .crt file is missing at fitimage sanity check - - - --- 2026-09-24 Tobias Pistora Superseded
[AUH] repo: upgrading to 2.68.1 SUCCEEDED [AUH] repo: upgrading to 2.68.1 SUCCEEDED - - - --- 2026-09-24 auh@yoctoproject.org Under Review
[AUH] gnupg: upgrading to 2.5.24 SUCCEEDED [AUH] gnupg: upgrading to 2.5.24 SUCCEEDED - - - --- 2026-09-24 auh@yoctoproject.org Under Review
[AUH] python3-vcs-versioning: upgrading to 2.5.0 SUCCEEDED [AUH] python3-vcs-versioning: upgrading to 2.5.0 SUCCEEDED - - - --- 2026-09-24 auh@yoctoproject.org Under Review
[AUH] python3-wcwidth: upgrading to 0.9.1 SUCCEEDED [AUH] python3-wcwidth: upgrading to 0.9.1 SUCCEEDED - - - --- 2026-09-24 auh@yoctoproject.org Under Review
[AUH] shadow: upgrading to 4.20.3 FAILED [AUH] shadow: upgrading to 4.20.3 FAILED - - - --- 2026-09-24 auh@yoctoproject.org New
[AUH] python3-setuptools-scm: upgrading to 10.3.4 FAILED [AUH] python3-setuptools-scm: upgrading to 10.3.4 FAILED - - - --- 2026-09-24 auh@yoctoproject.org Under Review
[AUH] python3-pytz: upgrading to 2026.4 SUCCEEDED [AUH] python3-pytz: upgrading to 2026.4 SUCCEEDED - - - --- 2026-09-24 auh@yoctoproject.org Under Review
[v2,3/3] oe/package.py: copydebugsources: add all kernel source files Fix kernel complementary package installation - - - --- 2026-09-23 AdrianF Under Review
[v2,2/3] core-image.bbclass: do not pull the kernel -src package in via complementary packages Fix kernel complementary package installation - - - --- 2026-09-23 AdrianF Under Review
[v2,1/3] kernel.bbclass: make the -src package installable on purpose Fix kernel complementary package installation - - - --- 2026-09-23 AdrianF Under Review
[13/13] selftest: resulttooltests.py: add min-duration default test resulttool: add 'durations' subcommand and selftests - - - --- 2026-09-23 Trevor Gamblin Under Review
[12/13] selftest: resulttooltests.py: add short-tables ordering test resulttool: add 'durations' subcommand and selftests - - - --- 2026-09-23 Trevor Gamblin Under Review
[11/13] selftest: resulttooltests.py: add limit-after-sort test resulttool: add 'durations' subcommand and selftests - - - --- 2026-09-23 Trevor Gamblin Under Review
[10/13] selftest: resulttooltests.py: add sort-by-delta test resulttool: add 'durations' subcommand and selftests - - - --- 2026-09-23 Trevor Gamblin Under Review
[09/13] selftest: resulttooltests.py: add None-pct threshold test resulttool: add 'durations' subcommand and selftests - - - --- 2026-09-23 Trevor Gamblin Under Review
[08/13] selftest: resulttooltests.py: add multi-pair threshold test resulttool: add 'durations' subcommand and selftests - - - --- 2026-09-23 Trevor Gamblin Under Review
[07/13] selftest: resulttooltests.py: add threshold-disabled test resulttool: add 'durations' subcommand and selftests - - - --- 2026-09-23 Trevor Gamblin Under Review
[06/13] selftest: resulttooltests.py: add threshold filtering test resulttool: add 'durations' subcommand and selftests - - - --- 2026-09-23 Trevor Gamblin Under Review
[05/13] selftest: resulttooltests.py: add consecutive-pair delta test resulttool: add 'durations' subcommand and selftests - - - --- 2026-09-23 Trevor Gamblin Under Review
[04/13] selftest: resulttooltests.py: add zero-round pct suppression test resulttool: add 'durations' subcommand and selftests - - - --- 2026-09-23 Trevor Gamblin Under Review
[03/13] selftest: resulttooltests.py: add report-log Time(s) column test resulttool: add 'durations' subcommand and selftests - - - --- 2026-09-23 Trevor Gamblin Under Review
[02/13] selftest: resulttooltests.py: add basic durations test resulttool: add 'durations' subcommand and selftests - - - --- 2026-09-23 Trevor Gamblin Under Review
[01/13] scripts: resulttool: add 'durations' option resulttool: add 'durations' subcommand and selftests - - - --- 2026-09-23 Trevor Gamblin Under Review
[scarthgap] u-boot-tools: use all patches from u-boot [scarthgap] u-boot-tools: use all patches from u-boot - - - --- 2026-09-23 Marko, Peter ycongal_smile Under Review
coreutils: Upgrade 9.11 -> 9.12 coreutils: Upgrade 9.11 -> 9.12 - - - --- 2026-09-23 Leon Anavi Under Review
[scarthgap,v2] python3-click: fix CVE-2026-7246 [scarthgap,v2] python3-click: fix CVE-2026-7246 - - - --- 2026-09-23 Darsh Kelaiya -X (dkelaiya - E INFOCHIPS PRIVATE LIMITED at Cisco) ycongal_smile Changes Requested
[AUH] gpgme: upgrading to 2.2.0 SUCCEEDED [AUH] gpgme: upgrading to 2.2.0 SUCCEEDED - - - --- 2026-09-23 auh@yoctoproject.org New
[AUH] python3-mako: upgrading to 1.4.3 SUCCEEDED [AUH] python3-mako: upgrading to 1.4.3 SUCCEEDED - - - --- 2026-09-23 auh@yoctoproject.org New
[AUH] gnupg: upgrading to 2.5.23 SUCCEEDED [AUH] gnupg: upgrading to 2.5.23 SUCCEEDED - - - --- 2026-09-23 auh@yoctoproject.org New
[AUH] python3-uv-build: upgrading to 0.12.18 SUCCEEDED [AUH] python3-uv-build: upgrading to 0.12.18 SUCCEEDED - - - --- 2026-09-23 auh@yoctoproject.org New
[AUH] python3-pdm-backend: upgrading to 2.4.10 SUCCEEDED [AUH] python3-pdm-backend: upgrading to 2.4.10 SUCCEEDED - - - --- 2026-09-23 auh@yoctoproject.org New
[AUH] python3-hypothesis: upgrading to 6.168.1 SUCCEEDED [AUH] python3-hypothesis: upgrading to 6.168.1 SUCCEEDED - - - --- 2026-09-23 auh@yoctoproject.org New
[AUH] python3-cython: upgrading to 3.3.0 SUCCEEDED [AUH] python3-cython: upgrading to 3.3.0 SUCCEEDED - - - --- 2026-09-23 auh@yoctoproject.org New
[AUH] meson: upgrading to 1.12.1 SUCCEEDED [AUH] meson: upgrading to 1.12.1 SUCCEEDED - - - --- 2026-09-23 auh@yoctoproject.org New
[AUH] libslirp: upgrading to 4.9.5 SUCCEEDED [AUH] libslirp: upgrading to 4.9.5 SUCCEEDED - - - --- 2026-09-23 auh@yoctoproject.org New
[AUH] expat: upgrading to 2.8.5 SUCCEEDED [AUH] expat: upgrading to 2.8.5 SUCCEEDED - - - --- 2026-09-23 auh@yoctoproject.org New
initramfs-framework: retry LABEL lookup before coldplug fallback initramfs-framework: retry LABEL lookup before coldplug fallback - - - --- 2026-09-23 Wenwen Fu Changes Requested
create-spdx-3.0: record component release date in SPDX output create-spdx-3.0: record component release date in SPDX output - - - --- 2026-09-22 Daniel Turull Changes Requested
[5/5] go-mod-update-modules: include the generated files from the class [1/5] gcr: initialize libgcrypt from the secret exchange - - - --- 2026-09-22 Markus Volk Under Review
[4/5] license_finder: normalise license texts before hashing [1/5] gcr: initialize libgcrypt from the secret exchange - - - --- 2026-09-22 Markus Volk Under Review
[3/5] spdx_license: give UnknownId a name [1/5] gcr: initialize libgcrypt from the secret exchange - - - --- 2026-09-22 Markus Volk Under Review
[2/5] cpan: survive the Makefile that MakeMaker rebuilds under us [1/5] gcr: initialize libgcrypt from the secret exchange - - - --- 2026-09-22 Markus Volk Changes Requested
« 1 2 3 4 … 172 173 »