Toggle navigation
Patchwork
OpenEmbedded Core Layer
Patches
Bundles
About this project
Login
Register
Mail settings
Show patches with
: State =
Action Required
| Archived =
No
| 15582 patches
Series
Submitter
State
any
Action Required
New
Under Review
Accepted
Rejected
RFC
Not Applicable
Changes Requested
Awaiting Upstream
Superseded
Deferred
Search
Archived
No
Yes
Both
Delegate
------
Nobody
gitpwbot
gitpwbot
gitpwbot
gitpwbot
gitpwbot
gitpwbot
gitpwbot
gitpwbot
mototimo
mototimo
mototimo
kraj
kraj
denix
denix
reatmon
reatmon
rpurdie
rpurdie
rpurdie
rpurdie
sakoman
ycongal_smile
ycongal_smile
ycongal_smile
rossburton
rossburton
jonmason
abelloni
abelloni
agodard
mathieu
anujm
fatho
fatho
fatho
boucman
boucman
boucman
Apply
«
1
2
3
4
…
155
156
»
Patch
Series
A/R/T
S/W/F
Date
Submitter
Delegate
State
[scarthgap,v2] glibc: Fix CVE-2026-6238
[scarthgap,v2] glibc: Fix CVE-2026-6238
- - -
-
-
-
2026-09-24
Varatharajan, Deepesh
ycongal_smile
New
[v2] kernel-fit-image: remove fatal error when .crt file is missing
[v2] kernel-fit-image: remove fatal error when .crt file is missing
- - -
-
-
-
2026-09-24
Tobias Pistora
New
remove fatal error when .crt file is missing at fitimage sanity check
remove fatal error when .crt file is missing at fitimage sanity check
- - -
-
-
-
2026-09-24
Tobias Pistora
New
barebox: install generated dtbs
barebox: install generated dtbs
- - -
-
-
-
2026-09-24
Fabian Pfitzner
New
[2/2] devtool: ide-sdk: allow ide plugins to add packages rootfs-dbg
[1/2] devtool: ide-sdk: make nfs export script quicker
- - -
-
-
-
2026-09-24
AdrianF
New
[1/2] devtool: ide-sdk: make nfs export script quicker
[1/2] devtool: ide-sdk: make nfs export script quicker
- - -
-
-
-
2026-09-24
AdrianF
New
[AUH] repo: upgrading to 2.68.1 SUCCEEDED
[AUH] repo: upgrading to 2.68.1 SUCCEEDED
- - -
-
-
-
2026-09-24
auh@yoctoproject.org
New
[AUH] gnupg: upgrading to 2.5.24 SUCCEEDED
[AUH] gnupg: upgrading to 2.5.24 SUCCEEDED
- - -
-
-
-
2026-09-24
auh@yoctoproject.org
New
[AUH] python3-vcs-versioning: upgrading to 2.5.0 SUCCEEDED
[AUH] python3-vcs-versioning: upgrading to 2.5.0 SUCCEEDED
- - -
-
-
-
2026-09-24
auh@yoctoproject.org
New
[AUH] python3-wcwidth: upgrading to 0.9.1 SUCCEEDED
[AUH] python3-wcwidth: upgrading to 0.9.1 SUCCEEDED
- - -
-
-
-
2026-09-24
auh@yoctoproject.org
New
[AUH] shadow: upgrading to 4.20.3 FAILED
[AUH] shadow: upgrading to 4.20.3 FAILED
- - -
-
-
-
2026-09-24
auh@yoctoproject.org
New
[AUH] python3-setuptools-scm: upgrading to 10.3.4 FAILED
[AUH] python3-setuptools-scm: upgrading to 10.3.4 FAILED
- - -
-
-
-
2026-09-24
auh@yoctoproject.org
New
[AUH] python3-pytz: upgrading to 2026.4 SUCCEEDED
[AUH] python3-pytz: upgrading to 2026.4 SUCCEEDED
- - -
-
-
-
2026-09-24
auh@yoctoproject.org
New
[v2,3/3] oe/package.py: copydebugsources: add all kernel source files
Fix kernel complementary package installation
- - -
-
-
-
2026-09-23
AdrianF
New
[v2,2/3] core-image.bbclass: do not pull the kernel -src package in via complementary packages
Fix kernel complementary package installation
- - -
-
-
-
2026-09-23
AdrianF
New
[v2,1/3] kernel.bbclass: make the -src package installable on purpose
Fix kernel complementary package installation
- - -
-
-
-
2026-09-23
AdrianF
New
[13/13] selftest: resulttooltests.py: add min-duration default test
resulttool: add 'durations' subcommand and selftests
- - -
-
-
-
2026-09-23
Trevor Gamblin
New
[12/13] selftest: resulttooltests.py: add short-tables ordering test
resulttool: add 'durations' subcommand and selftests
- - -
-
-
-
2026-09-23
Trevor Gamblin
New
[11/13] selftest: resulttooltests.py: add limit-after-sort test
resulttool: add 'durations' subcommand and selftests
- - -
-
-
-
2026-09-23
Trevor Gamblin
New
[10/13] selftest: resulttooltests.py: add sort-by-delta test
resulttool: add 'durations' subcommand and selftests
- - -
-
-
-
2026-09-23
Trevor Gamblin
New
[09/13] selftest: resulttooltests.py: add None-pct threshold test
resulttool: add 'durations' subcommand and selftests
- - -
-
-
-
2026-09-23
Trevor Gamblin
New
[08/13] selftest: resulttooltests.py: add multi-pair threshold test
resulttool: add 'durations' subcommand and selftests
- - -
-
-
-
2026-09-23
Trevor Gamblin
New
[07/13] selftest: resulttooltests.py: add threshold-disabled test
resulttool: add 'durations' subcommand and selftests
- - -
-
-
-
2026-09-23
Trevor Gamblin
New
[06/13] selftest: resulttooltests.py: add threshold filtering test
resulttool: add 'durations' subcommand and selftests
- - -
-
-
-
2026-09-23
Trevor Gamblin
New
[05/13] selftest: resulttooltests.py: add consecutive-pair delta test
resulttool: add 'durations' subcommand and selftests
- - -
-
-
-
2026-09-23
Trevor Gamblin
New
[04/13] selftest: resulttooltests.py: add zero-round pct suppression test
resulttool: add 'durations' subcommand and selftests
- - -
-
-
-
2026-09-23
Trevor Gamblin
New
[03/13] selftest: resulttooltests.py: add report-log Time(s) column test
resulttool: add 'durations' subcommand and selftests
- - -
-
-
-
2026-09-23
Trevor Gamblin
New
[02/13] selftest: resulttooltests.py: add basic durations test
resulttool: add 'durations' subcommand and selftests
- - -
-
-
-
2026-09-23
Trevor Gamblin
New
[01/13] scripts: resulttool: add 'durations' option
resulttool: add 'durations' subcommand and selftests
- - -
-
-
-
2026-09-23
Trevor Gamblin
New
[scarthgap] u-boot-tools: use all patches from u-boot
[scarthgap] u-boot-tools: use all patches from u-boot
- - -
-
-
-
2026-09-23
Peter Marko
ycongal_smile
New
coreutils: Upgrade 9.11 -> 9.12
coreutils: Upgrade 9.11 -> 9.12
- - -
-
-
-
2026-09-23
Leon Anavi
New
[scarthgap] systemd: backport networkd route readiness fix from upstream
[scarthgap] systemd: backport networkd route readiness fix from upstream
- - -
-
-
-
2026-09-23
Akash Hadke
ycongal_smile
New
[scarthgap,v2] python3-click: fix CVE-2026-7246
[scarthgap,v2] python3-click: fix CVE-2026-7246
- - -
-
-
-
2026-09-23
Darsh Kelaiya -X (dkelaiya - E INFOCHIPS PRIVATE LIMITED at Cisco)
ycongal_smile
New
[AUH] gpgme: upgrading to 2.2.0 SUCCEEDED
[AUH] gpgme: upgrading to 2.2.0 SUCCEEDED
- - -
-
-
-
2026-09-23
auh@yoctoproject.org
New
[AUH] python3-mako: upgrading to 1.4.3 SUCCEEDED
[AUH] python3-mako: upgrading to 1.4.3 SUCCEEDED
- - -
-
-
-
2026-09-23
auh@yoctoproject.org
New
[AUH] gnupg: upgrading to 2.5.23 SUCCEEDED
[AUH] gnupg: upgrading to 2.5.23 SUCCEEDED
- - -
-
-
-
2026-09-23
auh@yoctoproject.org
New
[AUH] python3-uv-build: upgrading to 0.12.18 SUCCEEDED
[AUH] python3-uv-build: upgrading to 0.12.18 SUCCEEDED
- - -
-
-
-
2026-09-23
auh@yoctoproject.org
New
[AUH] python3-pdm-backend: upgrading to 2.4.10 SUCCEEDED
[AUH] python3-pdm-backend: upgrading to 2.4.10 SUCCEEDED
- - -
-
-
-
2026-09-23
auh@yoctoproject.org
New
[AUH] python3-hypothesis: upgrading to 6.168.1 SUCCEEDED
[AUH] python3-hypothesis: upgrading to 6.168.1 SUCCEEDED
- - -
-
-
-
2026-09-23
auh@yoctoproject.org
New
[AUH] python3-cython: upgrading to 3.3.0 SUCCEEDED
[AUH] python3-cython: upgrading to 3.3.0 SUCCEEDED
- - -
-
-
-
2026-09-23
auh@yoctoproject.org
New
[AUH] meson: upgrading to 1.12.1 SUCCEEDED
[AUH] meson: upgrading to 1.12.1 SUCCEEDED
- - -
-
-
-
2026-09-23
auh@yoctoproject.org
New
[AUH] libslirp: upgrading to 4.9.5 SUCCEEDED
[AUH] libslirp: upgrading to 4.9.5 SUCCEEDED
- - -
-
-
-
2026-09-23
auh@yoctoproject.org
New
[AUH] expat: upgrading to 2.8.5 SUCCEEDED
[AUH] expat: upgrading to 2.8.5 SUCCEEDED
- - -
-
-
-
2026-09-23
auh@yoctoproject.org
New
[scarthgap] vim: fix backport format for CVE-2026-73076
[scarthgap] vim: fix backport format for CVE-2026-73076
- - -
-
-
-
2026-09-23
Hitendra Prajapati
ycongal_smile
New
create-spdx-3.0: record component release date in SPDX output
create-spdx-3.0: record component release date in SPDX output
- - -
-
-
-
2026-09-22
Daniel Turull
New
[wrynose] cpio: fix "CVE:" marker in CVE-2026-66484.patch
[wrynose] cpio: fix "CVE:" marker in CVE-2026-66484.patch
- - -
-
-
-
2026-09-22
Yoann Congal
ycongal_smile
Under Review
[5/5] go-mod-update-modules: include the generated files from the class
[1/5] gcr: initialize libgcrypt from the secret exchange
- - -
-
-
-
2026-09-22
Markus Volk
New
[4/5] license_finder: normalise license texts before hashing
[1/5] gcr: initialize libgcrypt from the secret exchange
- - -
-
-
-
2026-09-22
Markus Volk
New
[3/5] spdx_license: give UnknownId a name
[1/5] gcr: initialize libgcrypt from the secret exchange
- - -
-
-
-
2026-09-22
Markus Volk
New
[2/5] cpan: survive the Makefile that MakeMaker rebuilds under us
[1/5] gcr: initialize libgcrypt from the secret exchange
- - -
-
-
-
2026-09-22
Markus Volk
New
[1/5] gcr: initialize libgcrypt from the secret exchange
[1/5] gcr: initialize libgcrypt from the secret exchange
- - -
-
-
-
2026-09-22
Markus Volk
New
externalsrc: fix PKGV for devtool build
externalsrc: fix PKGV for devtool build
- - -
-
-
-
2026-09-22
Paddy Chiu
New
[scarthgap,v2,3/3] python3-cryptography: Fix CVE-2026-69249
[scarthgap,v2,1/3] python3-cryptography: Fix CVE-2026-34073
- - -
-
-
-
2026-09-22
Vijay Anusuri
ycongal_smile
Under Review
[scarthgap,v2,2/3] python3-cryptography: Fix CVE-2026-69248
[scarthgap,v2,1/3] python3-cryptography: Fix CVE-2026-34073
- - -
-
-
-
2026-09-22
Vijay Anusuri
ycongal_smile
Under Review
[scarthgap,v2,1/3] python3-cryptography: Fix CVE-2026-34073
[scarthgap,v2,1/3] python3-cryptography: Fix CVE-2026-34073
- - -
-
-
-
2026-09-22
Vijay Anusuri
ycongal_smile
Under Review
[wrynose,4/5] ffmpeg: Fix for CVE-2026-66039
[wrynose,1/5] ffmpeg: Fix for CVE-2026-66036
- - -
-
-
-
2026-09-22
Bhavesh Rajesh Maheshwari
ycongal_smile
Under Review
[wrynose,3/5] ffmpeg: Fix for CVE-2026-66038
[wrynose,1/5] ffmpeg: Fix for CVE-2026-66036
- - -
-
-
-
2026-09-22
Bhavesh Rajesh Maheshwari
ycongal_smile
Under Review
[wrynose,2/5] ffmpeg: Fix for CVE-2026-66037
[wrynose,1/5] ffmpeg: Fix for CVE-2026-66036
- - -
-
-
-
2026-09-22
Bhavesh Rajesh Maheshwari
ycongal_smile
Under Review
[wrynose] bitbake.conf: pseudo add rootfs-dbg to PSEUDO_INCLUDE_PATHS
[wrynose] bitbake.conf: pseudo add rootfs-dbg to PSEUDO_INCLUDE_PATHS
- - -
-
-
-
2026-09-22
Peter Marko
ycongal_smile
Under Review
[wrynose] qemu: fix CVE-2026-48914
[wrynose] qemu: fix CVE-2026-48914
- - -
-
-
-
2026-09-22
Roopa Kalmath
ycongal_smile
Under Review
[AUH] repo: upgrading to 2.68 SUCCEEDED
[AUH] repo: upgrading to 2.68 SUCCEEDED
- - -
-
-
-
2026-09-22
auh@yoctoproject.org
New
[AUH] libsolv: upgrading to 0.7.40 SUCCEEDED
[AUH] libsolv: upgrading to 0.7.40 SUCCEEDED
- - -
-
-
-
2026-09-22
auh@yoctoproject.org
New
[AUH] diffoscope: upgrading to 330 SUCCEEDED
[AUH] diffoscope: upgrading to 330 SUCCEEDED
- - -
-
-
-
2026-09-22
auh@yoctoproject.org
New
[AUH] python3-trove-classifiers: upgrading to 2026.9.21.13 SUCCEEDED
[AUH] python3-trove-classifiers: upgrading to 2026.9.21.13 SUCCEEDED
- - -
-
-
-
2026-09-22
auh@yoctoproject.org
New
[AUH] ttyrun: upgrading to 2.44.1 SUCCEEDED
[AUH] ttyrun: upgrading to 2.44.1 SUCCEEDED
- - -
-
-
-
2026-09-22
auh@yoctoproject.org
New
[2/2] oe-pkgdata-util: use PACKAGE_BASENAME for glob PN-substitution fallback
Fix kernel complementary package installation
- - -
-
-
-
2026-09-21
AdrianF
New
[1/2] package: introduce PACKAGE_BASENAME for consistent kernel -src naming
Fix kernel complementary package installation
- - -
-
-
-
2026-09-21
AdrianF
New
[v2,2/3] systemd: dlopen-deps: only warn for missing required providers
systemd musl build fixes and nfs-utils upgrade
- - -
-
-
-
2026-09-21
Jaipaul Cheernam
New
[v2,1/3] systemd: fix musl build by fixing limits.h override
systemd musl build fixes and nfs-utils upgrade
- - -
-
-
-
2026-09-21
Jaipaul Cheernam
New
[scarthgap,v2] python3: skip ptest incompatible with ptest-runner >= 2.5.0
[scarthgap,v2] python3: skip ptest incompatible with ptest-runner >= 2.5.0
- - -
-
-
-
2026-09-21
Yoann Congal
ycongal_smile
Under Review
[scarthgap,v2,7/7] libpcap: Fix CVE-2026-18238
libpcap: backport seven CVE fixes from 1.10.7
- - -
-
-
-
2026-09-21
Jaipaul Cheernam
ycongal_smile
New
[scarthgap,v2,6/7] libpcap: Fix CVE-2026-18313
libpcap: backport seven CVE fixes from 1.10.7
- - -
-
-
-
2026-09-21
Jaipaul Cheernam
ycongal_smile
New
[scarthgap,v2,5/7] libpcap: Fix CVE-2026-6554
libpcap: backport seven CVE fixes from 1.10.7
- - -
-
-
-
2026-09-21
Jaipaul Cheernam
ycongal_smile
New
[scarthgap,v2,4/7] libpcap: Fix CVE-2026-6244
libpcap: backport seven CVE fixes from 1.10.7
- - -
-
-
-
2026-09-21
Jaipaul Cheernam
ycongal_smile
New
[scarthgap,v2,3/7] libpcap: Fix CVE-2026-31911
libpcap: backport seven CVE fixes from 1.10.7
- - -
-
-
-
2026-09-21
Jaipaul Cheernam
ycongal_smile
New
[scarthgap,v2,2/7] libpcap: Fix CVE-2026-31912
libpcap: backport seven CVE fixes from 1.10.7
- - -
-
-
-
2026-09-21
Jaipaul Cheernam
ycongal_smile
New
[scarthgap,v2,1/7] libpcap: Fix CVE-2026-0799
libpcap: backport seven CVE fixes from 1.10.7
- - -
-
-
-
2026-09-21
Jaipaul Cheernam
ycongal_smile
New
[v3] psmisc: add ptest support
[v3] psmisc: add ptest support
- - -
-
-
-
2026-09-21
Pratik Farkase
New
[v3] psmisc: add ptest support
[v3] psmisc: add ptest support
- - -
-
-
-
2026-09-21
Pratik Farkase
New
[2/3] systemd: dlopen-deps: only warn for missing required providers
nfs-utils: musl upgrade to 3.1.1 and prerequisite systemd fixes
- - -
-
-
-
2026-09-21
Jaipaul Cheernam
New
[1/3] systemd: fix musl build by providing missing POSIX limits
nfs-utils: musl upgrade to 3.1.1 and prerequisite systemd fixes
- - -
-
-
-
2026-09-21
Jaipaul Cheernam
New
[v2] tiff: add ptest support
[v2] tiff: add ptest support
- - -
-
-
-
2026-09-21
Himani Ramesh Barde
New
[scarthgap] alsa-lib: Add ptest
[scarthgap] alsa-lib: Add ptest
- - -
-
-
-
2026-09-21
Sana Kazi
ycongal_smile
New
[master,PATCHv2] alsa-lib: Add ptest
[master,PATCHv2] alsa-lib: Add ptest
- - -
-
-
-
2026-09-21
Sana Kazi
New
[wrynose] alsa-lib: Add ptest
[wrynose] alsa-lib: Add ptest
- - -
-
-
-
2026-09-21
Sana Kazi
ycongal_smile
New
[10/20] barebox-tools: upgrade 2026.08.0 -> 2026.09.0
[01/20] ffmpeg: upgrade 9.0.1 -> 9.0.2
- - -
-
-
-
2026-09-21
Richard Purdie
New
[06/20] python3-hatchling: upgrade 1.32.0 -> 1.32.3
[01/20] ffmpeg: upgrade 9.0.1 -> 9.0.2
- - -
-
-
-
2026-09-21
Richard Purdie
New
[AUH] utfcpp: upgrading to 4.2.1 SUCCEEDED
[AUH] utfcpp: upgrading to 4.2.1 SUCCEEDED
- - -
-
-
-
2026-09-21
auh@yoctoproject.org
New
[AUH] fribidi: upgrading to 1.0.17 SUCCEEDED
[AUH] fribidi: upgrading to 1.0.17 SUCCEEDED
- - -
-
-
-
2026-09-21
auh@yoctoproject.org
New
[AUH] gzip: upgrading to 1.15 SUCCEEDED
[AUH] gzip: upgrading to 1.15 SUCCEEDED
- - -
-
-
-
2026-09-21
auh@yoctoproject.org
New
[AUH] rsync: upgrading to 3.5.1 FAILED
[AUH] rsync: upgrading to 3.5.1 FAILED
- - -
-
-
-
2026-09-21
auh@yoctoproject.org
New
[AUH] harfbuzz: upgrading to 14.5.0 SUCCEEDED
[AUH] harfbuzz: upgrading to 14.5.0 SUCCEEDED
- - -
-
-
-
2026-09-21
auh@yoctoproject.org
New
[AUH] cairo: upgrading to 1.18.6 SUCCEEDED
[AUH] cairo: upgrading to 1.18.6 SUCCEEDED
- - -
-
-
-
2026-09-21
auh@yoctoproject.org
New
[AUH] stress-ng: upgrading to 0.22.01 SUCCEEDED
[AUH] stress-ng: upgrading to 0.22.01 SUCCEEDED
- - -
-
-
-
2026-09-21
auh@yoctoproject.org
New
[AUH] python3-hatchling: upgrading to 1.32.4 SUCCEEDED
[AUH] python3-hatchling: upgrading to 1.32.4 SUCCEEDED
- - -
-
-
-
2026-09-21
auh@yoctoproject.org
New
[AUH] python3-pyparsing: upgrading to 3.3.3 SUCCEEDED
[AUH] python3-pyparsing: upgrading to 3.3.3 SUCCEEDED
- - -
-
-
-
2026-09-21
auh@yoctoproject.org
New
[wrynose,5/5] python3-sbom-cve-check: update to version 1.3.5
[wrynose,1/5] sbom-cve-check-update-nvd-native,sbom-cve-check-update-cvelist-native: upgrade 2026.0…
- - -
-
-
-
2026-09-20
Peter Marko
ycongal_smile
Under Review
[wrynose,4/5] sbom-cve-check-update-{nvd-native,cvelist-native}: upgrade 2026.08.25 -> 2026.09.12
[wrynose,1/5] sbom-cve-check-update-nvd-native,sbom-cve-check-update-cvelist-native: upgrade 2026.0…
- - -
-
-
-
2026-09-20
Peter Marko
ycongal_smile
Under Review
[wrynose,3/5] python3-sbom-cve-check: update to version 1.3.4
[wrynose,1/5] sbom-cve-check-update-nvd-native,sbom-cve-check-update-cvelist-native: upgrade 2026.0…
- - -
-
-
-
2026-09-20
Peter Marko
ycongal_smile
Under Review
[wrynose,2/5] sbom-cve-check-update-db: Exclude recipes from rm_work
[wrynose,1/5] sbom-cve-check-update-nvd-native,sbom-cve-check-update-cvelist-native: upgrade 2026.0…
- - -
-
-
-
2026-09-20
Peter Marko
ycongal_smile
Under Review
«
1
2
3
4
…
155
156
»