Toggle navigation
Patchwork
OpenEmbedded Core Layer
Patches
Bundles
About this project
Login
Register
Mail settings
Show patches with
: Archived =
No
| 17220 patches
Series
Submitter
State
any
Action Required
New
Under Review
Accepted
Rejected
RFC
Not Applicable
Changes Requested
Awaiting Upstream
Superseded
Deferred
Search
Archived
No
Yes
Both
Delegate
------
Nobody
gitpwbot
gitpwbot
gitpwbot
gitpwbot
gitpwbot
gitpwbot
gitpwbot
gitpwbot
mototimo
mototimo
mototimo
kraj
kraj
denix
denix
reatmon
reatmon
rpurdie
rpurdie
rpurdie
rpurdie
sakoman
ycongal_smile
ycongal_smile
ycongal_smile
rossburton
rossburton
jonmason
abelloni
abelloni
agodard
mathieu
anujm
fatho
fatho
fatho
boucman
boucman
boucman
Apply
«
1
2
3
4
…
172
173
»
Patch
Series
A/R/T
S/W/F
Date
Submitter
Delegate
State
[1/2] elfutils: Fix backtrace ptests on musl
[1/2] elfutils: Fix backtrace ptests on musl
- - -
-
-
-
2026-09-28
Khem Raj
Changes Requested
multilib: skip cross-canadian recipes when renaming package variables
multilib: skip cross-canadian recipes when renaming package variables
- - -
-
-
-
2026-09-28
mark.yang
Under Review
[2/2] toolchain-scripts/meta-environment: use each variant's own site files
[1/2] siteinfo: add siteinfo_get_files_for_machine()
- - -
-
-
-
2026-09-28
mark.yang
Under Review
[1/2] siteinfo: add siteinfo_get_files_for_machine()
[1/2] siteinfo: add siteinfo_get_files_for_machine()
- - -
-
-
-
2026-09-28
mark.yang
Under Review
[5/5] oe-selftest: devtool ide-sdk: cover modified + shared + NFS
devtool ide-sdk: support --modified and --shared modes
- - -
-
-
-
2026-09-27
AdrianF
Under Review
[4/5] devtool: ide-sdk: allow combining shared and modified modes
devtool ide-sdk: support --modified and --shared modes
- - -
-
-
-
2026-09-27
AdrianF
Under Review
[3/5] devtool: ide-sdk: support NFS exports in shared mode
devtool ide-sdk: support --modified and --shared modes
- - -
-
-
-
2026-09-27
AdrianF
Under Review
[2/5] devtool: ide-sdk: initialize shared images for IDE plugins
devtool ide-sdk: support --modified and --shared modes
- - -
-
-
-
2026-09-27
AdrianF
Under Review
[1/5] devtool: ide-sdk: support shared recipe IDE hooks
devtool ide-sdk: support --modified and --shared modes
- - -
-
-
-
2026-09-27
AdrianF
Under Review
[1/8] erofs-utils: Make reproducible for different BUILD_ARCH
[1/8] erofs-utils: Make reproducible for different BUILD_ARCH
- - -
-
-
-
2026-09-27
Richard Purdie
Under Review
[wrynose,8/8] pulseaudio: set status for CVE-2020-15710 and CVE-2020-16123
[wrynose,1/8] glibc: set status for CVE-2011-0536 and CVE-2025-0577
- - -
-
-
-
2026-09-27
Peter Marko
New
[wrynose,7/8] ppp: set status for CVE-2020-15704
[wrynose,1/8] glibc: set status for CVE-2011-0536 and CVE-2025-0577
- - -
-
-
-
2026-09-27
Peter Marko
New
[wrynose,6/8] ovmf: set status of CVE-2017-5731 and CVE-2019-14584
[wrynose,1/8] glibc: set status for CVE-2011-0536 and CVE-2025-0577
- - -
-
-
-
2026-09-27
Peter Marko
New
[wrynose,5/8] openssl: set status for CVE-2015-3216
[wrynose,1/8] glibc: set status for CVE-2011-0536 and CVE-2025-0577
- - -
-
-
-
2026-09-27
Peter Marko
New
[wrynose,4/8] nfs-utils: set status for CVE-2025-12801
[wrynose,1/8] glibc: set status for CVE-2011-0536 and CVE-2025-0577
- - -
-
-
-
2026-09-27
Peter Marko
New
[wrynose,3/8] libarchive: set status for CVE-2026-4424
[wrynose,1/8] glibc: set status for CVE-2011-0536 and CVE-2025-0577
- - -
-
-
-
2026-09-27
Peter Marko
New
[wrynose,2/8] gnutls: set status for CVE-2023-0361
[wrynose,1/8] glibc: set status for CVE-2011-0536 and CVE-2025-0577
- - -
-
-
-
2026-09-27
Peter Marko
New
[wrynose,1/8] glibc: set status for CVE-2011-0536 and CVE-2025-0577
[wrynose,1/8] glibc: set status for CVE-2011-0536 and CVE-2025-0577
- - -
-
-
-
2026-09-27
Peter Marko
New
[wrynose,28/28] linux-yocto/6.18: fix kernel reproducibility issues
[wrynose,01/28] go: upgrade 1.26.7 -> 1.26.8
- - -
-
-
-
2026-09-27
Yoann Congal
New
[wrynose,27/28] linux-yocto/6.18: update to v6.18.52
[wrynose,01/28] go: upgrade 1.26.7 -> 1.26.8
- - -
-
-
-
2026-09-27
Yoann Congal
New
[wrynose,26/28] linux-yocto/6.18: update to v6.18.50
[wrynose,01/28] go: upgrade 1.26.7 -> 1.26.8
- - -
-
-
-
2026-09-27
Yoann Congal
New
[wrynose,25/28] linux-yocto/6.18: rt: update to v6.18.37-rt6
[wrynose,01/28] go: upgrade 1.26.7 -> 1.26.8
- - -
-
-
-
2026-09-27
Yoann Congal
New
[wrynose,24/28] sstate: Update unpack touch code to be consistent
[wrynose,01/28] go: upgrade 1.26.7 -> 1.26.8
- - -
-
-
-
2026-09-27
Yoann Congal
New
[wrynose,23/28] sstate: Update mtime/atime for sig/siginfo files in sstate_checkhashes()
[wrynose,01/28] go: upgrade 1.26.7 -> 1.26.8
- - -
-
-
-
2026-09-27
Yoann Congal
New
[wrynose,22/28] ffmpeg: Fix for CVE-2026-66039
[wrynose,01/28] go: upgrade 1.26.7 -> 1.26.8
- - -
-
-
-
2026-09-27
Yoann Congal
New
[wrynose,21/28] ffmpeg: Fix for CVE-2026-66038
[wrynose,01/28] go: upgrade 1.26.7 -> 1.26.8
- - -
-
-
-
2026-09-27
Yoann Congal
New
[wrynose,20/28] ffmpeg: Fix for CVE-2026-66037
[wrynose,01/28] go: upgrade 1.26.7 -> 1.26.8
- - -
-
-
-
2026-09-27
Yoann Congal
New
[wrynose,19/28] bitbake.conf: pseudo add rootfs-dbg to PSEUDO_INCLUDE_PATHS
[wrynose,01/28] go: upgrade 1.26.7 -> 1.26.8
- - -
-
-
-
2026-09-27
Yoann Congal
New
[wrynose,18/28] qemu: fix CVE-2026-48914
[wrynose,01/28] go: upgrade 1.26.7 -> 1.26.8
- - -
-
-
-
2026-09-27
Yoann Congal
New
[wrynose,17/28] python3-sbom-cve-check: update to version 1.3.5
[wrynose,01/28] go: upgrade 1.26.7 -> 1.26.8
- - -
-
-
-
2026-09-27
Yoann Congal
New
[wrynose,16/28] sbom-cve-check-update-{nvd-native,cvelist-native}: upgrade 2026.08.25 -> 2026.09.12
[wrynose,01/28] go: upgrade 1.26.7 -> 1.26.8
- - -
-
-
-
2026-09-27
Yoann Congal
New
[wrynose,15/28] python3-sbom-cve-check: update to version 1.3.4
[wrynose,01/28] go: upgrade 1.26.7 -> 1.26.8
- - -
-
-
-
2026-09-27
Yoann Congal
New
[wrynose,14/28] sbom-cve-check-update-db: Exclude recipes from rm_work
[wrynose,01/28] go: upgrade 1.26.7 -> 1.26.8
- - -
-
-
-
2026-09-27
Yoann Congal
New
[wrynose,13/28] sbom-cve-check-update-nvd-native,sbom-cve-check-update-cvelist-native: upgrade 2026…
[wrynose,01/28] go: upgrade 1.26.7 -> 1.26.8
- - -
-
-
-
2026-09-27
Yoann Congal
New
[wrynose,12/28] at-spi2-core: RDEPENDS on gsettings-desktop-schemas
[wrynose,01/28] go: upgrade 1.26.7 -> 1.26.8
- - -
-
-
-
2026-09-27
Yoann Congal
New
[wrynose,11/28] toolchain-scripts: fix kernel host tool builds broken in the SDK
[wrynose,01/28] go: upgrade 1.26.7 -> 1.26.8
- - -
-
-
-
2026-09-27
Yoann Congal
New
[wrynose,10/28] vim: Fix CVE-2026-28417 hostname regression
[wrynose,01/28] go: upgrade 1.26.7 -> 1.26.8
- - -
-
-
-
2026-09-27
Yoann Congal
New
[wrynose,09/28] fmt: update branch name to main
[wrynose,01/28] go: upgrade 1.26.7 -> 1.26.8
- - -
-
-
-
2026-09-27
Yoann Congal
New
[wrynose,08/28] bluez5: restrict delta=0 RSSI to proximity filters
[wrynose,01/28] go: upgrade 1.26.7 -> 1.26.8
- - -
-
-
-
2026-09-27
Yoann Congal
New
[wrynose,07/28] libxfont2: patch CVE-2026-44950
[wrynose,01/28] go: upgrade 1.26.7 -> 1.26.8
- - -
-
-
-
2026-09-27
Yoann Congal
New
[wrynose,06/28] libxfont2: patch CVE-2026-59679
[wrynose,01/28] go: upgrade 1.26.7 -> 1.26.8
- - -
-
-
-
2026-09-27
Yoann Congal
New
[wrynose,05/28] ffmpeg: mark CVE-2026-52295, CVE-2026-52296 and CVE-2026-52297 fixed
[wrynose,01/28] go: upgrade 1.26.7 -> 1.26.8
- - -
-
-
-
2026-09-27
Yoann Congal
New
[wrynose,04/28] kernel-fit-image: Don't add hash node when signing is enabled
[wrynose,01/28] go: upgrade 1.26.7 -> 1.26.8
- - -
-
-
-
2026-09-27
Yoann Congal
New
[wrynose,03/28] dhcpcd: upgrade 10.3.1 -> 10.3.2
[wrynose,01/28] go: upgrade 1.26.7 -> 1.26.8
- - -
-
-
-
2026-09-27
Yoann Congal
New
[wrynose,02/28] cpio: fix "CVE:" marker in CVE-2026-66484.patch
[wrynose,01/28] go: upgrade 1.26.7 -> 1.26.8
- - -
-
-
-
2026-09-27
Yoann Congal
New
[wrynose,01/28] go: upgrade 1.26.7 -> 1.26.8
[wrynose,01/28] go: upgrade 1.26.7 -> 1.26.8
- - -
-
-
-
2026-09-27
Yoann Congal
New
[AUH] gtk-doc: upgrading to 1.37.0 SUCCEEDED
[AUH] gtk-doc: upgrading to 1.37.0 SUCCEEDED
- - -
-
-
-
2026-09-27
auh@yoctoproject.org
New
[AUH] python3-meson-python: upgrading to 0.22.0 SUCCEEDED
[AUH] python3-meson-python: upgrading to 0.22.0 SUCCEEDED
- - -
-
-
-
2026-09-27
auh@yoctoproject.org
New
[PATCHv2] cpan: do not rebuild the Makefile when perls config is re-staged
[PATCHv2] cpan: do not rebuild the Makefile when perls config is re-staged
- - -
-
-
-
2026-09-26
Markus Volk
Under Review
libpcre2-ptest: add testoutput3C for locale variant
libpcre2-ptest: add testoutput3C for locale variant
- - -
-
-
-
2026-09-26
Ronvelia, Bhavikkumar Girishbhai
Superseded
[AUH] diffoscope: upgrading to 331 SUCCEEDED
[AUH] diffoscope: upgrading to 331 SUCCEEDED
- - -
-
-
-
2026-09-26
auh@yoctoproject.org
New
[AUH] python3-pbr: upgrading to 7.1.2 SUCCEEDED
[AUH] python3-pbr: upgrading to 7.1.2 SUCCEEDED
- - -
-
-
-
2026-09-26
auh@yoctoproject.org
Under Review
[AUH] python3-markdown: upgrading to 3.11 SUCCEEDED
[AUH] python3-markdown: upgrading to 3.11 SUCCEEDED
- - -
-
-
-
2026-09-26
auh@yoctoproject.org
New
compiler-rt: Use specific arm architecture instead of 'arm'
compiler-rt: Use specific arm architecture instead of 'arm'
- - -
-
-
-
2026-09-25
Jan Strater-Büddefeld
Changes Requested
[v2,2/2] scripts/contrib: add spdx-release-date-report.py
[v2,1/2] create-spdx-3.0: record component release date in SPDX output
- - -
-
-
-
2026-09-25
Daniel Turull
Changes Requested
[v2,1/2] create-spdx-3.0: record component release date in SPDX output
[v2,1/2] create-spdx-3.0: record component release date in SPDX output
- - -
-
-
-
2026-09-25
Daniel Turull
Changes Requested
[v3] tiff: add ptest support
[v3] tiff: add ptest support
- - -
-
-
-
2026-09-25
Himani Ramesh Barde
Changes Requested
[AUH] parted: upgrading to 3.8 SUCCEEDED
[AUH] parted: upgrading to 3.8 SUCCEEDED
- - -
-
-
-
2026-09-25
auh@yoctoproject.org
New
[AUH] epiphany: upgrading to 51.1 SUCCEEDED
[AUH] epiphany: upgrading to 51.1 SUCCEEDED
- - -
-
-
-
2026-09-25
auh@yoctoproject.org
New
[AUH] libuv: upgrading to 1.53.0 SUCCEEDED
[AUH] libuv: upgrading to 1.53.0 SUCCEEDED
- - -
-
-
-
2026-09-25
auh@yoctoproject.org
New
[AUH] libpam: upgrading to 1.7.3 SUCCEEDED
[AUH] libpam: upgrading to 1.7.3 SUCCEEDED
- - -
-
-
-
2026-09-25
auh@yoctoproject.org
New
[AUH] python3-uv-build: upgrading to 0.12.19 SUCCEEDED
[AUH] python3-uv-build: upgrading to 0.12.19 SUCCEEDED
- - -
-
-
-
2026-09-25
auh@yoctoproject.org
New
libx11: stage the X11 locale data in the native sysroot
libx11: stage the X11 locale data in the native sysroot
- - -
-
-
-
2026-09-25
Markus Volk
Under Review
[4/4] dwarfsrcfiles: remove
[1/4] lib/oe/package: remove unused and optional fatal argument to source_info()
- - -
-
-
-
2026-09-24
Ross Burton
Under Review
[3/4] classes/package: use eu-srcfiles instead of dwarfsrcfiles
[1/4] lib/oe/package: remove unused and optional fatal argument to source_info()
- - -
-
-
-
2026-09-24
Ross Burton
Under Review
[scarthgap,v2,2/2] python3-pyasn1: fix CVE-2026-59885
[OE-core[scarthgap,v2,1/2] python3-pyasn1: fix CVE-2026-30922
- - -
-
-
-
2026-09-24
Yogita Urade
ycongal_smile
New
[OE-core[scarthgap,v2,1/2] python3-pyasn1: fix CVE-2026-30922
[OE-core[scarthgap,v2,1/2] python3-pyasn1: fix CVE-2026-30922
- - -
-
-
-
2026-09-24
Yogita Urade
New
[v3] systemd: fix musl build by fixing limits.h override
[v3] systemd: fix musl build by fixing limits.h override
- - -
-
-
-
2026-09-24
Ross Burton
Changes Requested
[scarthgap,v2] glibc: Fix CVE-2026-6238
[scarthgap,v2] glibc: Fix CVE-2026-6238
- - -
-
-
-
2026-09-24
Varatharajan, Deepesh
ycongal_smile
Under Review
remove fatal error when .crt file is missing at fitimage sanity check
remove fatal error when .crt file is missing at fitimage sanity check
- - -
-
-
-
2026-09-24
Tobias Pistora
Superseded
[AUH] repo: upgrading to 2.68.1 SUCCEEDED
[AUH] repo: upgrading to 2.68.1 SUCCEEDED
- - -
-
-
-
2026-09-24
auh@yoctoproject.org
Under Review
[AUH] gnupg: upgrading to 2.5.24 SUCCEEDED
[AUH] gnupg: upgrading to 2.5.24 SUCCEEDED
- - -
-
-
-
2026-09-24
auh@yoctoproject.org
Under Review
[AUH] python3-vcs-versioning: upgrading to 2.5.0 SUCCEEDED
[AUH] python3-vcs-versioning: upgrading to 2.5.0 SUCCEEDED
- - -
-
-
-
2026-09-24
auh@yoctoproject.org
Under Review
[AUH] python3-wcwidth: upgrading to 0.9.1 SUCCEEDED
[AUH] python3-wcwidth: upgrading to 0.9.1 SUCCEEDED
- - -
-
-
-
2026-09-24
auh@yoctoproject.org
Under Review
[AUH] shadow: upgrading to 4.20.3 FAILED
[AUH] shadow: upgrading to 4.20.3 FAILED
- - -
-
-
-
2026-09-24
auh@yoctoproject.org
New
[AUH] python3-setuptools-scm: upgrading to 10.3.4 FAILED
[AUH] python3-setuptools-scm: upgrading to 10.3.4 FAILED
- - -
-
-
-
2026-09-24
auh@yoctoproject.org
Under Review
[AUH] python3-pytz: upgrading to 2026.4 SUCCEEDED
[AUH] python3-pytz: upgrading to 2026.4 SUCCEEDED
- - -
-
-
-
2026-09-24
auh@yoctoproject.org
Under Review
[v2,3/3] oe/package.py: copydebugsources: add all kernel source files
Fix kernel complementary package installation
- - -
-
-
-
2026-09-23
AdrianF
Under Review
[v2,2/3] core-image.bbclass: do not pull the kernel -src package in via complementary packages
Fix kernel complementary package installation
- - -
-
-
-
2026-09-23
AdrianF
Under Review
[v2,1/3] kernel.bbclass: make the -src package installable on purpose
Fix kernel complementary package installation
- - -
-
-
-
2026-09-23
AdrianF
Under Review
[13/13] selftest: resulttooltests.py: add min-duration default test
resulttool: add 'durations' subcommand and selftests
- - -
-
-
-
2026-09-23
Trevor Gamblin
Under Review
[12/13] selftest: resulttooltests.py: add short-tables ordering test
resulttool: add 'durations' subcommand and selftests
- - -
-
-
-
2026-09-23
Trevor Gamblin
Under Review
[11/13] selftest: resulttooltests.py: add limit-after-sort test
resulttool: add 'durations' subcommand and selftests
- - -
-
-
-
2026-09-23
Trevor Gamblin
Under Review
[10/13] selftest: resulttooltests.py: add sort-by-delta test
resulttool: add 'durations' subcommand and selftests
- - -
-
-
-
2026-09-23
Trevor Gamblin
Under Review
[09/13] selftest: resulttooltests.py: add None-pct threshold test
resulttool: add 'durations' subcommand and selftests
- - -
-
-
-
2026-09-23
Trevor Gamblin
Under Review
[08/13] selftest: resulttooltests.py: add multi-pair threshold test
resulttool: add 'durations' subcommand and selftests
- - -
-
-
-
2026-09-23
Trevor Gamblin
Under Review
[07/13] selftest: resulttooltests.py: add threshold-disabled test
resulttool: add 'durations' subcommand and selftests
- - -
-
-
-
2026-09-23
Trevor Gamblin
Under Review
[06/13] selftest: resulttooltests.py: add threshold filtering test
resulttool: add 'durations' subcommand and selftests
- - -
-
-
-
2026-09-23
Trevor Gamblin
Under Review
[05/13] selftest: resulttooltests.py: add consecutive-pair delta test
resulttool: add 'durations' subcommand and selftests
- - -
-
-
-
2026-09-23
Trevor Gamblin
Under Review
[04/13] selftest: resulttooltests.py: add zero-round pct suppression test
resulttool: add 'durations' subcommand and selftests
- - -
-
-
-
2026-09-23
Trevor Gamblin
Under Review
[03/13] selftest: resulttooltests.py: add report-log Time(s) column test
resulttool: add 'durations' subcommand and selftests
- - -
-
-
-
2026-09-23
Trevor Gamblin
Under Review
[02/13] selftest: resulttooltests.py: add basic durations test
resulttool: add 'durations' subcommand and selftests
- - -
-
-
-
2026-09-23
Trevor Gamblin
Under Review
[01/13] scripts: resulttool: add 'durations' option
resulttool: add 'durations' subcommand and selftests
- - -
-
-
-
2026-09-23
Trevor Gamblin
Under Review
[scarthgap] u-boot-tools: use all patches from u-boot
[scarthgap] u-boot-tools: use all patches from u-boot
- - -
-
-
-
2026-09-23
Peter Marko
ycongal_smile
New
coreutils: Upgrade 9.11 -> 9.12
coreutils: Upgrade 9.11 -> 9.12
- - -
-
-
-
2026-09-23
Leon Anavi
Under Review
[scarthgap] systemd: backport networkd route readiness fix from upstream
[scarthgap] systemd: backport networkd route readiness fix from upstream
- - -
-
-
-
2026-09-23
Akash Hadke
ycongal_smile
Under Review
[scarthgap,v2] python3-click: fix CVE-2026-7246
[scarthgap,v2] python3-click: fix CVE-2026-7246
- - -
-
-
-
2026-09-23
Darsh Kelaiya -X (dkelaiya - E INFOCHIPS PRIVATE LIMITED at Cisco)
ycongal_smile
Under Review
[AUH] gpgme: upgrading to 2.2.0 SUCCEEDED
[AUH] gpgme: upgrading to 2.2.0 SUCCEEDED
- - -
-
-
-
2026-09-23
auh@yoctoproject.org
New
[AUH] python3-mako: upgrading to 1.4.3 SUCCEEDED
[AUH] python3-mako: upgrading to 1.4.3 SUCCEEDED
- - -
-
-
-
2026-09-23
auh@yoctoproject.org
New
[AUH] gnupg: upgrading to 2.5.23 SUCCEEDED
[AUH] gnupg: upgrading to 2.5.23 SUCCEEDED
- - -
-
-
-
2026-09-23
auh@yoctoproject.org
New
«
1
2
3
4
…
172
173
»