Show patches with: Archived = No       |   17252 patches
« 1 2 ... 18 19 20 … 172 173 »
Patch Series A/R/T S/W/F Date Submitter Delegate State
[RFCv3] xuser-account: convert to standard-user-account [RFCv3] xuser-account: convert to standard-user-account - - - --- 2026-06-05 Randolph Sapp RFC
[RFCv2] xuser-account: convert to standard-user-account [RFCv2] xuser-account: convert to standard-user-account - - - --- 2026-06-05 Randolph Sapp RFC
[3/4] python3: remove obsolete skips of some ctypes tests [1/4] libedit: upgrade 20251016 -> 20260512 - - - --- 2026-06-05 Ross Burton Changes Requested
[2/4] python3: remove toolchain dependencies in python3-ptest [1/4] libedit: upgrade 20251016 -> 20260512 - - - --- 2026-06-05 Ross Burton Changes Requested
[2/2] rootfs,spdx: handle removed packages [1/2] rootfs: move tasks using image_list_installed_packages to postuninstall - - - --- 2026-06-05 Marko, Peter Changes Requested
[v2] vim-tiny: bugfix lack of defaults.vim [v2] vim-tiny: bugfix lack of defaults.vim - - - --- 2026-06-05 Zheng Ruoqin Changes Requested
gawk: improve randtest stability gawk: improve randtest stability - - - --- 2026-06-05 Aditya GS Changes Requested
tiff: add ptest support tiff: add ptest support - - - --- 2026-06-05 Jiao, Shilong Changes Requested
gawk: improve randtest stability gawk: improve randtest stability - - - --- 2026-06-05 Aditya GS Rejected
[4/4] templates/default: adjust instructions for qemu UI frontends [1/4] python3-qemu-qmp: add a recipe - - - --- 2026-06-04 Alexander Kanavin Changes Requested
[3/4] qemu: disable SDL UI frontend [1/4] python3-qemu-qmp: add a recipe - - - --- 2026-06-04 Alexander Kanavin Under Review
xorg-minimal-fonts: Note where the binaries are build from xorg-minimal-fonts: Note where the binaries are build from - - - --- 2026-06-03 Richard Purdie Accepted
kernel-fit-image: skip sstate creation for deploy kernel-fit-image: skip sstate creation for deploy - - - --- 2026-06-03 Tafil Avdyli Changes Requested
[v3,2/2] oe-selftest: fitimage: support new schema for uboot configuration signing [v3,1/2] uboot-sign: sign SPL FIT configurations instead of images - - - --- 2026-06-03 Marta Rybczynska Changes Requested
[v3,1/2] uboot-sign: sign SPL FIT configurations instead of images [v3,1/2] uboot-sign: sign SPL FIT configurations instead of images - - - --- 2026-06-03 Marta Rybczynska Changes Requested
diffstat: upgrade 1.68 -> 1.69 diffstat: upgrade 1.68 -> 1.69 - - - --- 2026-06-03 Changqing Li Changes Requested
[2/2] selftes: test_testimage_virgl_gtk_sdl: run only if gtk or sdl are enabled in base config [1/2] qemu: disable SDL UI frontend - - - --- 2026-06-02 Alexander Kanavin Superseded
[1/2] qemu: disable SDL UI frontend [1/2] qemu: disable SDL UI frontend - - - --- 2026-06-02 Alexander Kanavin Superseded
[master,v2] rsync: add ptest support [master,v2] rsync: add ptest support - - - --- 2026-06-02 Nikhil R Changes Requested
[3/3] python3-libpcap: add recipe [1/3] python3-pkg-about: add recipe - - - --- 2026-06-02 Frederik Brændstrup Rejected
[2/3] python3-py-utlx: add recipe [1/3] python3-pkg-about: add recipe - - - --- 2026-06-02 Frederik Brændstrup Rejected
[1/3] python3-pkg-about: add recipe [1/3] python3-pkg-about: add recipe - - - --- 2026-06-02 Frederik Brændstrup Rejected
python3-packaging: 26.0 -> 26.2 python3-packaging: 26.0 -> 26.2 - - - --- 2026-06-02 Frederik Brændstrup Changes Requested
[v3] qemuboot.bbclass: add missing task dependency on kernel deploy [v3] qemuboot.bbclass: add missing task dependency on kernel deploy - - - --- 2026-06-02 Siva Kumar Balasubramanian Changes Requested
u-boot-tools: include dtc yaml patch u-boot-tools: include dtc yaml patch - - - --- 2026-06-02 Frederik Brændstrup Changes Requested
[v5,4/4] yocto-check-layer.bbclass: enforce missing SRCREV check during layer validation Add missing SRCREV check for SCM URIs - - - --- 2026-06-02 Sai Sneha Changes Requested
[v5,3/4] insane.bbclass: add missing-srcrev QA check for SCM URIs Add missing SRCREV check for SCM URIs - - - --- 2026-06-02 Sai Sneha Changes Requested
[v5,2/4] base.bbclass: warn when SRCREV is missing for SCM URIs at parse time Add missing SRCREV check for SCM URIs - - - --- 2026-06-02 Sai Sneha Changes Requested
[v5,1/4] oe/qa.py: add check_uri_srcrev() helper for SCM URI SRCREV validation Add missing SRCREV check for SCM URIs - - - --- 2026-06-02 Sai Sneha Changes Requested
[v2] qemuboot.bbclass: add missing task dependency on kernel deploy [v2] qemuboot.bbclass: add missing task dependency on kernel deploy - - - --- 2026-06-01 Siva Kumar Balasubramanian Changes Requested
[master] rsync: add ptest support [master] rsync: add ptest support - - - --- 2026-06-01 Nikhil R Changes Requested
[AUH] sqlite3: upgrading to 3.53.1 SUCCEEDED [AUH] sqlite3: upgrading to 3.53.1 SUCCEEDED - - - --- 2026-06-01 auh@yoctoproject.org New
[AUH] libmd: upgrading to 1.2.0 SUCCEEDED [AUH] libmd: upgrading to 1.2.0 SUCCEEDED - - - --- 2026-06-01 auh@yoctoproject.org New
[AUH] taglib: upgrading to 2.3 SUCCEEDED [AUH] taglib: upgrading to 2.3 SUCCEEDED - - - --- 2026-06-01 auh@yoctoproject.org New
[AUH] utfcpp: upgrading to 4.1.1 SUCCEEDED [AUH] utfcpp: upgrading to 4.1.1 SUCCEEDED - - - --- 2026-06-01 auh@yoctoproject.org New
[AUH] libusb1: upgrading to 1.0.30 SUCCEEDED [AUH] libusb1: upgrading to 1.0.30 SUCCEEDED - - - --- 2026-06-01 auh@yoctoproject.org New
[AUH] libjitterentropy: upgrading to 3.7.0 FAILED [AUH] libjitterentropy: upgrading to 3.7.0 FAILED - - - --- 2026-06-01 auh@yoctoproject.org New
[AUH] libksba: upgrading to 1.8.0 SUCCEEDED [AUH] libksba: upgrading to 1.8.0 SUCCEEDED - - - --- 2026-06-01 auh@yoctoproject.org New
[AUH] nettle: upgrading to 4.0 SUCCEEDED [AUH] nettle: upgrading to 4.0 SUCCEEDED - - - --- 2026-06-01 auh@yoctoproject.org New
[AUH] libgpg-error: upgrading to 1.61 SUCCEEDED [AUH] libgpg-error: upgrading to 1.61 SUCCEEDED - - - --- 2026-06-01 auh@yoctoproject.org New
[AUH] libgit2: upgrading to 1.9.4 SUCCEEDED [AUH] libgit2: upgrading to 1.9.4 SUCCEEDED - - - --- 2026-06-01 auh@yoctoproject.org New
[AUH] libfyaml: upgrading to 0.9.6 FAILED [AUH] libfyaml: upgrading to 0.9.6 FAILED - - - --- 2026-06-01 auh@yoctoproject.org New
[AUH] hwdata: upgrading to 0.407 SUCCEEDED [AUH] hwdata: upgrading to 0.407 SUCCEEDED - - - --- 2026-06-01 auh@yoctoproject.org New
[AUH] gpgme: upgrading to 2.1.0 SUCCEEDED [AUH] gpgme: upgrading to 2.1.0 SUCCEEDED - - - --- 2026-06-01 auh@yoctoproject.org New
[AUH] enchant2: upgrading to 2.8.16 SUCCEEDED [AUH] enchant2: upgrading to 2.8.16 SUCCEEDED - - - --- 2026-06-01 auh@yoctoproject.org New
[AUH] dos2unix: upgrading to 7.5.6 SUCCEEDED [AUH] dos2unix: upgrading to 7.5.6 SUCCEEDED - - - --- 2026-06-01 auh@yoctoproject.org New
[AUH] diffoscope: upgrading to 318 SUCCEEDED [AUH] diffoscope: upgrading to 318 SUCCEEDED - - - --- 2026-06-01 auh@yoctoproject.org New
[AUH] at-spi2-core: upgrading to 2.60.4 SUCCEEDED [AUH] at-spi2-core: upgrading to 2.60.4 SUCCEEDED - - - --- 2026-06-01 auh@yoctoproject.org New
[AUH] curl: upgrading to 8.20.0 FAILED [AUH] curl: upgrading to 8.20.0 FAILED - - - --- 2026-06-01 auh@yoctoproject.org New
[AUH] puzzles: upgrading to 7ad37c64af3bc891372ec16db1531cee599b6e3a SUCCEEDED [AUH] puzzles: upgrading to 7ad37c64af3bc891372ec16db1531cee599b6e3a SUCCEEDED - - - --- 2026-06-01 auh@yoctoproject.org New
[AUH] gstreamer1.0-libav: upgrading to 1.28.3 SUCCEEDED [AUH] gstreamer1.0-libav: upgrading to 1.28.3 SUCCEEDED - - - --- 2026-06-01 auh@yoctoproject.org New
[AUH] gstreamer1.0: upgrading to 1.28.3 SUCCEEDED [AUH] gstreamer1.0: upgrading to 1.28.3 SUCCEEDED - - - --- 2026-06-01 auh@yoctoproject.org New
[AUH] gst-examples: upgrading to 1.28.3 FAILED [AUH] gst-examples: upgrading to 1.28.3 FAILED - - - --- 2026-06-01 auh@yoctoproject.org New
[AUH] gst-devtools: upgrading to 1.28.3 SUCCEEDED [AUH] gst-devtools: upgrading to 1.28.3 SUCCEEDED - - - --- 2026-06-01 auh@yoctoproject.org New
[AUH] gstreamer1.0-python: upgrading to 1.28.3 SUCCEEDED [AUH] gstreamer1.0-python: upgrading to 1.28.3 SUCCEEDED - - - --- 2026-06-01 auh@yoctoproject.org New
[AUH] dtc: upgrading to 1.8.1 FAILED [AUH] dtc: upgrading to 1.8.1 FAILED - - - --- 2026-06-01 auh@yoctoproject.org New
[AUH] wireless-regdb: upgrading to 2026.05.30 SUCCEEDED [AUH] wireless-regdb: upgrading to 2026.05.30 SUCCEEDED - - - --- 2026-06-01 auh@yoctoproject.org New
[AUH] libxkbcommon: upgrading to 1.13.2 SUCCEEDED [AUH] libxkbcommon: upgrading to 1.13.2 SUCCEEDED - - - --- 2026-06-01 auh@yoctoproject.org New
[AUH] vulkan-volk: upgrading to 1.4.350.0 SUCCEEDED [AUH] vulkan-volk: upgrading to 1.4.350.0 SUCCEEDED - - - --- 2026-06-01 auh@yoctoproject.org New
[AUH] vulkan-loader: upgrading to 1.4.350.0 FAILED [AUH] vulkan-loader: upgrading to 1.4.350.0 FAILED - - - --- 2026-06-01 auh@yoctoproject.org New
[AUH] vulkan-samples: upgrading to f5daf09c2514b1bd30ffdf3e12fd6eaf857b69ca SUCCEEDED [AUH] vulkan-samples: upgrading to f5daf09c2514b1bd30ffdf3e12fd6eaf857b69ca SUCCEEDED - - - --- 2026-06-01 auh@yoctoproject.org New
[AUH] vulkan-tools: upgrading to 1.4.350.0 FAILED [AUH] vulkan-tools: upgrading to 1.4.350.0 FAILED - - - --- 2026-06-01 auh@yoctoproject.org New
[AUH] vulkan-validation-layers: upgrading to 1.4.350.0 FAILED [AUH] vulkan-validation-layers: upgrading to 1.4.350.0 FAILED - - - --- 2026-06-01 auh@yoctoproject.org New
[AUH] vulkan-utility-libraries: upgrading to 1.4.350.0 FAILED [AUH] vulkan-utility-libraries: upgrading to 1.4.350.0 FAILED - - - --- 2026-06-01 auh@yoctoproject.org New
[AUH] vulkan-headers: upgrading to 1.4.350.0 SUCCEEDED [AUH] vulkan-headers: upgrading to 1.4.350.0 SUCCEEDED - - - --- 2026-06-01 auh@yoctoproject.org New
[AUH] spirv-tools: upgrading to 1.4.350.0 FAILED [AUH] spirv-tools: upgrading to 1.4.350.0 FAILED - - - --- 2026-06-01 auh@yoctoproject.org New
[AUH] virglrenderer: upgrading to 1.3.0 FAILED [AUH] virglrenderer: upgrading to 1.3.0 FAILED - - - --- 2026-06-01 auh@yoctoproject.org New
[AUH] spirv-llvm-translator: upgrading to 22.1.3 FAILED [AUH] spirv-llvm-translator: upgrading to 22.1.3 FAILED - - - --- 2026-06-01 auh@yoctoproject.org New
[AUH] glslang: upgrading to 1.4.350.0 SUCCEEDED [AUH] glslang: upgrading to 1.4.350.0 SUCCEEDED - - - --- 2026-06-01 auh@yoctoproject.org New
[AUH] igt-gpu-tools: upgrading to 2.4 FAILED [AUH] igt-gpu-tools: upgrading to 2.4 FAILED - - - --- 2026-06-01 auh@yoctoproject.org New
[AUH] spirv-headers: upgrading to 1.4.350.0 SUCCEEDED [AUH] spirv-headers: upgrading to 1.4.350.0 SUCCEEDED - - - --- 2026-06-01 auh@yoctoproject.org New
[AUH] libdrm: upgrading to 2.4.134 SUCCEEDED [AUH] libdrm: upgrading to 2.4.134 SUCCEEDED - - - --- 2026-06-01 auh@yoctoproject.org New
[AUH] libxmlb: upgrading to 0.3.27 SUCCEEDED [AUH] libxmlb: upgrading to 0.3.27 SUCCEEDED - - - --- 2026-06-01 auh@yoctoproject.org New
[AUH] fontconfig: upgrading to 2.18.0 SUCCEEDED [AUH] fontconfig: upgrading to 2.18.0 SUCCEEDED - - - --- 2026-06-01 auh@yoctoproject.org New
[AUH] libadwaita: upgrading to 1.9.1 SUCCEEDED [AUH] libadwaita: upgrading to 1.9.1 SUCCEEDED - - - --- 2026-06-01 auh@yoctoproject.org New
[AUH] rpcbind: upgrading to 1.2.9 SUCCEEDED [AUH] rpcbind: upgrading to 1.2.9 SUCCEEDED - - - --- 2026-06-01 auh@yoctoproject.org New
[AUH] which: upgrading to 2.25 SUCCEEDED [AUH] which: upgrading to 2.25 SUCCEEDED - - - --- 2026-06-01 auh@yoctoproject.org New
[AUH] stress-ng: upgrading to 0.21.01 SUCCEEDED [AUH] stress-ng: upgrading to 0.21.01 SUCCEEDED - - - --- 2026-06-01 auh@yoctoproject.org New
[AUH] valgrind: upgrading to 3.27.1 SUCCEEDED [AUH] valgrind: upgrading to 3.27.1 SUCCEEDED - - - --- 2026-06-01 auh@yoctoproject.org New
[AUH] ghostscript: upgrading to 10.07.1 SUCCEEDED [AUH] ghostscript: upgrading to 10.07.1 SUCCEEDED - - - --- 2026-06-01 auh@yoctoproject.org New
[AUH] ltp: upgrading to 20260529 FAILED [AUH] ltp: upgrading to 20260529 FAILED - - - --- 2026-06-01 auh@yoctoproject.org New
[AUH] less: upgrading to 702 FAILED [AUH] less: upgrading to 702 FAILED - - - --- 2026-06-01 auh@yoctoproject.org New
[AUH] tcl8: upgrading to 8.6.18 SUCCEEDED [AUH] tcl8: upgrading to 8.6.18 SUCCEEDED - - - --- 2026-06-01 auh@yoctoproject.org New
[AUH] tcf-agent: upgrading to 1.11.0 FAILED [AUH] tcf-agent: upgrading to 1.11.0 FAILED - - - --- 2026-06-01 auh@yoctoproject.org New
[AUH] ruby: upgrading to 4.0.5 SUCCEEDED [AUH] ruby: upgrading to 4.0.5 SUCCEEDED - - - --- 2026-06-01 auh@yoctoproject.org New
[AUH] strace: upgrading to 7.0 SUCCEEDED [AUH] strace: upgrading to 7.0 SUCCEEDED - - - --- 2026-06-01 auh@yoctoproject.org New
[AUH] rsync: upgrading to 3.4.3 SUCCEEDED [AUH] rsync: upgrading to 3.4.3 SUCCEEDED - - - --- 2026-06-01 auh@yoctoproject.org New
[AUH] repo: upgrading to 2.64 SUCCEEDED [AUH] repo: upgrading to 2.64 SUCCEEDED - - - --- 2026-06-01 auh@yoctoproject.org New
[AUH] python3-zipp: upgrading to 4.1.0 SUCCEEDED [AUH] python3-zipp: upgrading to 4.1.0 SUCCEEDED - - - --- 2026-06-01 auh@yoctoproject.org New
[AUH] python3-wcwidth: upgrading to 0.7.0 SUCCEEDED [AUH] python3-wcwidth: upgrading to 0.7.0 SUCCEEDED - - - --- 2026-06-01 auh@yoctoproject.org New
[AUH] python3-uritools: upgrading to 6.1.2 FAILED [AUH] python3-uritools: upgrading to 6.1.2 FAILED - - - --- 2026-06-01 auh@yoctoproject.org New
[AUH] python3-uv-build: upgrading to 0.11.17 SUCCEEDED [AUH] python3-uv-build: upgrading to 0.11.17 SUCCEEDED - - - --- 2026-06-01 auh@yoctoproject.org New
[AUH] python3-trove-classifiers: upgrading to 2026.5.22.10 SUCCEEDED [AUH] python3-trove-classifiers: upgrading to 2026.5.22.10 SUCCEEDED - - - --- 2026-06-01 auh@yoctoproject.org New
[AUH] python3-rpds-py: upgrading to 2026.5.1 SUCCEEDED [AUH] python3-rpds-py: upgrading to 2026.5.1 SUCCEEDED - - - --- 2026-06-01 auh@yoctoproject.org New
[AUH] python3-snowballstemmer: upgrading to 3.1.0 SUCCEEDED [AUH] python3-snowballstemmer: upgrading to 3.1.0 SUCCEEDED - - - --- 2026-06-01 auh@yoctoproject.org New
[AUH] python3-pytz: upgrading to 2026.2 SUCCEEDED [AUH] python3-pytz: upgrading to 2026.2 SUCCEEDED - - - --- 2026-06-01 auh@yoctoproject.org New
[AUH] python3-pyelftools: upgrading to 0.33 SUCCEEDED [AUH] python3-pyelftools: upgrading to 0.33 SUCCEEDED - - - --- 2026-06-01 auh@yoctoproject.org New
[AUH] python3-pygobject: upgrading to 3.56.3 SUCCEEDED [AUH] python3-pygobject: upgrading to 3.56.3 SUCCEEDED - - - --- 2026-06-01 auh@yoctoproject.org New
[AUH] python3-packaging: upgrading to 26.2 SUCCEEDED [AUH] python3-packaging: upgrading to 26.2 SUCCEEDED - - - --- 2026-06-01 auh@yoctoproject.org New
[AUH] python3-pdm: upgrading to 2.27.0 SUCCEEDED [AUH] python3-pdm: upgrading to 2.27.0 SUCCEEDED - - - --- 2026-06-01 auh@yoctoproject.org New
« 1 2 ... 18 19 20 … 172 173 »