Toggle navigation
Patchwork
OpenEmbedded Core Layer
Patches
Bundles
About this project
Login
Register
Mail settings
Show patches with
: Archived =
No
| 17243 patches
Series
Submitter
State
any
Action Required
New
Under Review
Accepted
Rejected
RFC
Not Applicable
Changes Requested
Awaiting Upstream
Superseded
Deferred
Search
Archived
No
Yes
Both
Delegate
------
Nobody
gitpwbot
gitpwbot
gitpwbot
gitpwbot
gitpwbot
gitpwbot
gitpwbot
gitpwbot
mototimo
mototimo
mototimo
kraj
kraj
denix
denix
reatmon
reatmon
rpurdie
rpurdie
rpurdie
rpurdie
sakoman
ycongal_smile
ycongal_smile
ycongal_smile
rossburton
rossburton
jonmason
abelloni
abelloni
agodard
mathieu
anujm
fatho
fatho
fatho
boucman
boucman
boucman
Apply
«
1
2
...
10
11
12
…
172
173
»
Patch
Series
A/R/T
S/W/F
Date
Submitter
Delegate
State
[AUH] python3-vcs-versioning: upgrading to 2.2.3 SUCCEEDED
[AUH] python3-vcs-versioning: upgrading to 2.2.3 SUCCEEDED
- - -
-
-
-
2026-07-29
auh@yoctoproject.org
New
[AUH] python3-hypothesis: upgrading to 6.163.0 FAILED
[AUH] python3-hypothesis: upgrading to 6.163.0 FAILED
- - -
-
-
-
2026-07-29
auh@yoctoproject.org
New
[AUH] glslang: upgrading to 1.4.357.0 SUCCEEDED
[AUH] glslang: upgrading to 1.4.357.0 SUCCEEDED
- - -
-
-
-
2026-07-29
auh@yoctoproject.org
New
[AUH] python3-uv-build: upgrading to 0.12.0 SUCCEEDED
[AUH] python3-uv-build: upgrading to 0.12.0 SUCCEEDED
- - -
-
-
-
2026-07-29
auh@yoctoproject.org
New
[AUH] libarchive: upgrading to 3.8.9 SUCCEEDED
[AUH] libarchive: upgrading to 3.8.9 SUCCEEDED
- - -
-
-
-
2026-07-29
auh@yoctoproject.org
New
[AUH] pseudo: upgrading to 1.9.9 FAILED
[AUH] pseudo: upgrading to 1.9.9 FAILED
- - -
-
-
-
2026-07-29
auh@yoctoproject.org
New
[AUH] cmake,cmake-native: upgrading to 4.4.1,4.4.1 SUCCEEDED
[AUH] cmake,cmake-native: upgrading to 4.4.1,4.4.1 SUCCEEDED
- - -
-
-
-
2026-07-29
auh@yoctoproject.org
New
[v2] boost: make Boost.Locale ICU backend optional
[v2] boost: make Boost.Locale ICU backend optional
- - -
-
-
-
2026-07-29
Shinu Chandran
Changes Requested
kernel-devsrc: include tools needed for BTF when enabled
kernel-devsrc: include tools needed for BTF when enabled
- - -
-
-
-
2026-07-29
Wang Mingyu
Changes Requested
[AUH] libxmlb: upgrading to 0.3.29 SUCCEEDED
[AUH] libxmlb: upgrading to 0.3.29 SUCCEEDED
- - -
-
-
-
2026-07-28
auh@yoctoproject.org
New
[AUH] libmicrohttpd: upgrading to 1.0.7 SUCCEEDED
[AUH] libmicrohttpd: upgrading to 1.0.7 SUCCEEDED
- - -
-
-
-
2026-07-28
auh@yoctoproject.org
New
[AUH] python3-hypothesis: upgrading to 6.161.8 FAILED
[AUH] python3-hypothesis: upgrading to 6.161.8 FAILED
- - -
-
-
-
2026-07-28
auh@yoctoproject.org
New
[master] boost: make Boost.Locale ICU backend optional
[master] boost: make Boost.Locale ICU backend optional
- - -
-
-
-
2026-07-28
Shinu Chandran
Changes Requested
[v10,8/8] libarchive: Make it work with rpm 6
rpm: 4.20.1 -> 6.0.2
- - -
-
-
-
2026-07-27
Gavini, Sumanth
Changes Requested
[v10,7/8] rpm: 4.20.1 -> 6.0.2
rpm: 4.20.1 -> 6.0.2
- - -
-
-
-
2026-07-27
Gavini, Sumanth
Changes Requested
[v10,6/8] target-sdk-provides-dummy: Add pkg-config to DUMMYPROVIDES
rpm: 4.20.1 -> 6.0.2
- - -
-
-
-
2026-07-27
Gavini, Sumanth
Changes Requested
[v10,5/8] lib/oe/package.py: Don't redirect stderr
rpm: 4.20.1 -> 6.0.2
- - -
-
-
-
2026-07-27
Gavini, Sumanth
Changes Requested
[v10,4/8] lib/oe/package.py: Filter out /usr/bin/pkg-config file dependency
rpm: 4.20.1 -> 6.0.2
- - -
-
-
-
2026-07-27
Gavini, Sumanth
Changes Requested
[v10,3/8] lib/oe/package.py: Don't add ldconfig_postinst_fragment for glibc or musl
rpm: 4.20.1 -> 6.0.2
- - -
-
-
-
2026-07-27
Gavini, Sumanth
Changes Requested
[v10,2/8] package_rpm.bbclass: Define _lib and _libdir for rpmbuild
rpm: 4.20.1 -> 6.0.2
- - -
-
-
-
2026-07-27
Gavini, Sumanth
Changes Requested
[v10,1/8] package_rpm.bbclass: Drop external dependency generator to support rpm 6
rpm: 4.20.1 -> 6.0.2
- - -
-
-
-
2026-07-27
Gavini, Sumanth
Changes Requested
systemd: add watchdog device
systemd: add watchdog device
- - -
-
-
-
2026-07-27
Fabian Pflug
Changes Requested
[v2,3/3] kernel-fit-extra-artifacts: skip building linux.bin if unneeded
kernel-fit-image: allow replacing kernel, handle compression in FIT recipe
- - -
-
-
-
2026-07-27
Nora Schiffer
Changes Requested
[v2,2/3] kernel-fit-image: reintroduce option to replace kernel image
kernel-fit-image: allow replacing kernel, handle compression in FIT recipe
- - -
-
-
-
2026-07-27
Nora Schiffer
Changes Requested
[v2,1/3] kernel-uboot: move FIT_KERNEL_COMP_ALG to image-fitimage.conf
kernel-fit-image: allow replacing kernel, handle compression in FIT recipe
- - -
-
-
-
2026-07-27
Nora Schiffer
Changes Requested
[AUH] libical: upgrading to 4.0.4 SUCCEEDED
[AUH] libical: upgrading to 4.0.4 SUCCEEDED
- - -
-
-
-
2026-07-26
auh@yoctoproject.org
New
[AUH] python3-pytz: upgrading to 2026.3 SUCCEEDED
[AUH] python3-pytz: upgrading to 2026.3 SUCCEEDED
- - -
-
-
-
2026-07-26
auh@yoctoproject.org
New
[AUH] python3-hypothesis: upgrading to 6.161.5 FAILED
[AUH] python3-hypothesis: upgrading to 6.161.5 FAILED
- - -
-
-
-
2026-07-26
auh@yoctoproject.org
New
[1/1] rm_work: fix recipe self-exclusion lost when RM_WORK_EXCLUDE is conditional
rm_work: recipe self-exclusion vs conditional RM_WORK_EXCLUDE
- - -
-
-
-
2026-07-25
Zk47T
Changes Requested
scripts: contrib: Fix reserved typo in imporve_kernel_cve_report script
scripts: contrib: Fix reserved typo in imporve_kernel_cve_report script
- - -
-
-
-
2026-07-25
Markus Swarowsky
Under Review
[AUH] sqlite3: upgrading to 3.53.4 SUCCEEDED
[AUH] sqlite3: upgrading to 3.53.4 SUCCEEDED
- - -
-
-
-
2026-07-25
auh@yoctoproject.org
New
[AUH] appstream: upgrading to 1.1.5 FAILED
[AUH] appstream: upgrading to 1.1.5 FAILED
- - -
-
-
-
2026-07-25
auh@yoctoproject.org
New
[AUH] python3-cython: upgrading to 3.2.9 SUCCEEDED
[AUH] python3-cython: upgrading to 3.2.9 SUCCEEDED
- - -
-
-
-
2026-07-25
auh@yoctoproject.org
New
[AUH] python3-hypothesis: upgrading to 6.161.2 FAILED
[AUH] python3-hypothesis: upgrading to 6.161.2 FAILED
- - -
-
-
-
2026-07-25
auh@yoctoproject.org
New
[AUH] qemu-native,qemu,qemu-system-native: upgrading to 11.0.3,11.0.3,11.0.3 SUCCEEDED
[AUH] qemu-native,qemu,qemu-system-native: upgrading to 11.0.3,11.0.3,11.0.3 SUCCEEDED
- - -
-
-
-
2026-07-25
auh@yoctoproject.org
New
[v9,8/8] libarchive: Make it work with rpm 6
rpm: 4.20.1 -> 6.0.2
- - -
-
-
-
2026-07-24
Gavini, Sumanth
Changes Requested
[v9,7/8] rpm: 4.20.1 -> 6.0.2
rpm: 4.20.1 -> 6.0.2
- - -
-
-
-
2026-07-24
Gavini, Sumanth
Changes Requested
[v9,6/8] target-sdk-provides-dummy: Add pkg-config to DUMMYPROVIDES
rpm: 4.20.1 -> 6.0.2
- - -
-
-
-
2026-07-24
Gavini, Sumanth
Changes Requested
[v9,5/8] lib/oe/package.py: Don't redirect stderr
rpm: 4.20.1 -> 6.0.2
- - -
-
-
-
2026-07-24
Gavini, Sumanth
Changes Requested
[v9,4/8] lib/oe/package.py: Filter out /usr/bin/pkg-config file dependency
rpm: 4.20.1 -> 6.0.2
- - -
-
-
-
2026-07-24
Gavini, Sumanth
Changes Requested
[v9,3/8] lib/oe/package.py: Don't add ldconfig_postinst_fragment for glibc or musl
rpm: 4.20.1 -> 6.0.2
- - -
-
-
-
2026-07-24
Gavini, Sumanth
Changes Requested
[v9,2/8] package_rpm.bbclass: Define _lib and _libdir for rpmbuild
rpm: 4.20.1 -> 6.0.2
- - -
-
-
-
2026-07-24
Gavini, Sumanth
Changes Requested
[v9,1/8] package_rpm.bbclass: Drop external dependency generator to support rpm 6
rpm: 4.20.1 -> 6.0.2
- - -
-
-
-
2026-07-24
Gavini, Sumanth
Changes Requested
lib: oe: sbom: Improve SPDX parsing error debugging
lib: oe: sbom: Improve SPDX parsing error debugging
- - -
-
-
-
2026-07-24
Joshua Watt
Under Review
vim.inc: upgrade 9.2.0782 9.2.0843
vim.inc: upgrade 9.2.0782 9.2.0843
- - -
-
-
-
2026-07-24
Tim Orling
Under Review
[v4,10/10] packagegroup-cross-canadian: gate gdb behind SDK_FEATURES
wic: ship its tools, and add an SDK_FEATURES lever
- - -
-
-
-
2026-07-24
Trevor Woerner
Changes Requested
[v4,09/10] nativesdk-packagegroup-sdk-host: gate qemu behind SDK_FEATURES
wic: ship its tools, and add an SDK_FEATURES lever
- - -
-
-
-
2026-07-24
Trevor Woerner
Changes Requested
[v4,08/10] nativesdk-packagegroup-sdk-host: add an lldb SDK feature
wic: ship its tools, and add an SDK_FEATURES lever
- - -
-
-
-
2026-07-24
Trevor Woerner
Changes Requested
[v4,07/10] nativesdk-packagegroup-sdk-host: add an sbom SDK feature
wic: ship its tools, and add an SDK_FEATURES lever
- - -
-
-
-
2026-07-24
Trevor Woerner
Changes Requested
[v4,06/10] nativesdk-packagegroup-sdk-host: add wic to SDK_FEATURES
wic: ship its tools, and add an SDK_FEATURES lever
- - -
-
-
-
2026-07-24
Trevor Woerner
Changes Requested
[v4,05/10] nativesdk-packagegroup-sdk-host: add an SDK_FEATURES lever
wic: ship its tools, and add an SDK_FEATURES lever
- - -
-
-
-
2026-07-24
Trevor Woerner
Changes Requested
[v4,01/10] wic-tools: move bootloader firmware staging into the wic oe-selftest
wic: ship its tools, and add an SDK_FEATURES lever
- - -
-
-
-
2026-07-24
Trevor Woerner
Changes Requested
[v2] bitbake.conf: Extend distro feature usrmerge to merge bin+sbin
[v2] bitbake.conf: Extend distro feature usrmerge to merge bin+sbin
- - -
-
-
-
2026-07-24
Jörg Sommer
Changes Requested
[AUH] libdisplay-info: upgrading to 0.4.0 SUCCEEDED
[AUH] libdisplay-info: upgrading to 0.4.0 SUCCEEDED
- - -
-
-
-
2026-07-24
auh@yoctoproject.org
New
[AUH] python3-uritools: upgrading to 6.1.3 SUCCEEDED
[AUH] python3-uritools: upgrading to 6.1.3 SUCCEEDED
- - -
-
-
-
2026-07-24
auh@yoctoproject.org
New
[AUH] gnupg: upgrading to 2.5.21 SUCCEEDED
[AUH] gnupg: upgrading to 2.5.21 SUCCEEDED
- - -
-
-
-
2026-07-24
auh@yoctoproject.org
New
[AUH] python3-uv-build: upgrading to 0.11.32 SUCCEEDED
[AUH] python3-uv-build: upgrading to 0.11.32 SUCCEEDED
- - -
-
-
-
2026-07-24
auh@yoctoproject.org
New
[AUH] python3-hypothesis: upgrading to 6.161.1 FAILED
[AUH] python3-hypothesis: upgrading to 6.161.1 FAILED
- - -
-
-
-
2026-07-24
auh@yoctoproject.org
New
[AUH] dropbear: upgrading to 2026.94 SUCCEEDED
[AUH] dropbear: upgrading to 2026.94 SUCCEEDED
- - -
-
-
-
2026-07-24
auh@yoctoproject.org
New
[v2] kernel-arch: limit KERNEL_TOOLCHAIN to the kbuild recipes
[v2] kernel-arch: limit KERNEL_TOOLCHAIN to the kbuild recipes
- - -
-
-
-
2026-07-24
mark.yang
Changes Requested
kernel-arch: limit KERNEL_TOOLCHAIN to the kbuild recipes
kernel-arch: limit KERNEL_TOOLCHAIN to the kbuild recipes
- - -
-
-
-
2026-07-24
mark.yang
Superseded
sstate: FIXMESTAGINGDIRHOST is not getting restored properly for all recipes
sstate: FIXMESTAGINGDIRHOST is not getting restored properly for all recipes
- - -
-
-
-
2026-07-23
Shramana Chakraborty
Changes Requested
FIXMESTAGINGDIRHOST is not getting restored properly for all recipes
FIXMESTAGINGDIRHOST is not getting restored properly for all recipes
- - -
-
-
-
2026-07-23
Shramana Chakraborty
Changes Requested
default-distrovars: Enable minidebuginfo DISTRO_FEATURE by default
default-distrovars: Enable minidebuginfo DISTRO_FEATURE by default
- - -
-
-
-
2026-07-23
Richard Purdie
Changes Requested
[master] python3-pip: set CVE_PRODUCT
[master] python3-pip: set CVE_PRODUCT
- - -
-
-
-
2026-07-23
Himanshu Jadon -X (hjadon - E INFOCHIPS PRIVATE LIMITED at Cisco)
Under Review
[3/3] kernel-fit-extra-artifacts: skip building linux.bin if unneeded
kernel-fit-image: allow replacing kernel, handle compression in FIT recipe
- - -
-
-
-
2026-07-23
Nora Schiffer
Superseded
[2/3] kernel-fit-image: reintroduce option to replace kernel image
kernel-fit-image: allow replacing kernel, handle compression in FIT recipe
- - -
-
-
-
2026-07-23
Nora Schiffer
Superseded
[1/3] kernel-uboot: move FIT_KERNEL_COMP_ALG to image-fitimage.conf
kernel-fit-image: allow replacing kernel, handle compression in FIT recipe
- - -
-
-
-
2026-07-23
Nora Schiffer
Superseded
[3/3] oeqa/sdk/cases/rust.py: Add test to verify cargo build builds for target
[1/3] rust-cross-canadian: install target-specific env scripts and fix rustlib lookup
- - -
-
-
-
2026-07-23
Harish Sadineni
Changes Requested
[2/3] toolchain-scripts: source target-specific environment setup scripts
[1/3] rust-cross-canadian: install target-specific env scripts and fix rustlib lookup
- - -
-
-
-
2026-07-23
Harish Sadineni
Changes Requested
[1/3] rust-cross-canadian: install target-specific env scripts and fix rustlib lookup
[1/3] rust-cross-canadian: install target-specific env scripts and fix rustlib lookup
- - -
-
-
-
2026-07-23
Harish Sadineni
Changes Requested
[v3,5/5] oeqa/selftest/devtool: Add test for multiple nested git destsuffix repos
devtool: fix standalone clone conversion for nested git repos
- - -
-
-
-
2026-07-23
Jamin Lin
Changes Requested
[v3,4/5] meta-selftest: Add devtool-test-multi-destsuffix recipe
devtool: fix standalone clone conversion for nested git repos
- - -
-
-
-
2026-07-23
Jamin Lin
Changes Requested
[v3,3/5] devtool-source: Convert nested git SRC_URI destsuffix repos to standalone clones
devtool: fix standalone clone conversion for nested git repos
- - -
-
-
-
2026-07-23
Jamin Lin
Changes Requested
[v3,2/5] oe/patch: Skip commitIgnored when nothing is actually staged
devtool: fix standalone clone conversion for nested git repos
- - -
-
-
-
2026-07-23
Jamin Lin
Changes Requested
[v3,1/5] devtool: Detect nested git repos before the initial workspace commit
devtool: fix standalone clone conversion for nested git repos
- - -
-
-
-
2026-07-23
Jamin Lin
Changes Requested
[2/2] ncurses: stop moving terminfo files from /usr/share to /etc
[1/2] ncurses: put symlinks to basic terminfo files in ncurses-terminfo-base package
- - -
-
-
-
2026-07-23
Rasmus Villemoes
Changes Requested
[AUH] appstream: upgrading to 1.1.4 FAILED
[AUH] appstream: upgrading to 1.1.4 FAILED
- - -
-
-
-
2026-07-23
auh@yoctoproject.org
New
[AUH] ttyrun: upgrading to 2.43.1 SUCCEEDED
[AUH] ttyrun: upgrading to 2.43.1 SUCCEEDED
- - -
-
-
-
2026-07-23
auh@yoctoproject.org
New
[AUH] python3-hypothesis: upgrading to 6.160.0 FAILED
[AUH] python3-hypothesis: upgrading to 6.160.0 FAILED
- - -
-
-
-
2026-07-23
auh@yoctoproject.org
New
[AUH] bind: upgrading to 9.20.26 SUCCEEDED
[AUH] bind: upgrading to 9.20.26 SUCCEEDED
- - -
-
-
-
2026-07-23
auh@yoctoproject.org
New
[meta,v4,3/3] go-vendor.bbclass: Run vendor_unlink task under fakeroot
Create selftest suite for go-vendor.bbclass
- - -
-
-
-
2026-07-22
John Ripple
Under Review
[meta,v4,2/3] oeqa/selftest: Add go-vendor.bbclass selftest suite
Create selftest suite for go-vendor.bbclass
- - -
-
-
-
2026-07-22
John Ripple
Under Review
[meta,v4,1/3] go-vendor.bbclass: Fix test file exclusion and license propagation
Create selftest suite for go-vendor.bbclass
- - -
-
-
-
2026-07-22
John Ripple
Under Review
[2/2] python3-chardet: Enable tests
[1/2] python3-chardet: Upgrade 6.0.0.post1 -> 7.4.3.bb
- - -
-
-
-
2026-07-22
Leon Anavi
Rejected
[1/2] python3-chardet: Upgrade 6.0.0.post1 -> 7.4.3.bb
[1/2] python3-chardet: Upgrade 6.0.0.post1 -> 7.4.3.bb
- - -
-
-
-
2026-07-22
Leon Anavi
Rejected
[v3] systemd.bbclass: fix service enablement for cross-install scenarios
[v3] systemd.bbclass: fix service enablement for cross-install scenarios
- - -
-
-
-
2026-07-22
Himani Ramesh Barde
Changes Requested
[5/5] wget: fix CVE-2026-15146
[1/5] wget: fix CVE-2026-58469
- - -
-
-
-
2026-07-22
Amaury Couderc
Superseded
[3/5] wget: fix CVE-2026-58471
[1/5] wget: fix CVE-2026-58469
- - -
-
-
-
2026-07-22
Amaury Couderc
Superseded
[2/5] wget: fix CVE-2026-58470
[1/5] wget: fix CVE-2026-58469
- - -
-
-
-
2026-07-22
Amaury Couderc
Superseded
[v2] systemd.bbclass: fix service enablement for cross-install scenarios
[v2] systemd.bbclass: fix service enablement for cross-install scenarios
- - -
-
-
-
2026-07-22
Himani Ramesh Barde
Superseded
[AUH] python3-uv-build: upgrading to 0.11.31 SUCCEEDED
[AUH] python3-uv-build: upgrading to 0.11.31 SUCCEEDED
- - -
-
-
-
2026-07-22
auh@yoctoproject.org
New
[AUH] python3-setuptools-scm: upgrading to 10.2.1 SUCCEEDED
[AUH] python3-setuptools-scm: upgrading to 10.2.1 SUCCEEDED
- - -
-
-
-
2026-07-22
auh@yoctoproject.org
New
[AUH] python3-certifi: upgrading to 2026.7.22 SUCCEEDED
[AUH] python3-certifi: upgrading to 2026.7.22 SUCCEEDED
- - -
-
-
-
2026-07-22
auh@yoctoproject.org
New
[AUH] python3-hypothesis: upgrading to 6.158.1 FAILED
[AUH] python3-hypothesis: upgrading to 6.158.1 FAILED
- - -
-
-
-
2026-07-22
auh@yoctoproject.org
New
[AUH] dropbear: upgrading to 2026.93 FAILED
[AUH] dropbear: upgrading to 2026.93 FAILED
- - -
-
-
-
2026-07-22
auh@yoctoproject.org
New
[AUH] pkgconf: upgrading to 3.0.4 SUCCEEDED
[AUH] pkgconf: upgrading to 3.0.4 SUCCEEDED
- - -
-
-
-
2026-07-22
auh@yoctoproject.org
New
[4/4] python3-ply: set status for CVE-2025-56005
[1/4] openssh: set status for CVE-2026-55653
- - -
-
-
-
2026-07-21
Peter Marko
Rejected
[2/4] Add tag in SRC_URI in multiple recipes
Add missing tag parameter in git SRC_URI
- - -
-
-
-
2026-07-21
Daniel Turull
Accepted
[AUH] python3-uv-build: upgrading to 0.11.30 SUCCEEDED
[AUH] python3-uv-build: upgrading to 0.11.30 SUCCEEDED
- - -
-
-
-
2026-07-21
auh@yoctoproject.org
New
«
1
2
...
10
11
12
…
172
173
»