Toggle navigation
Patchwork
OpenEmbedded Core Layer
Patches
Bundles
About this project
Login
Register
Mail settings
Show patches with
: Archived =
No
| 17246 patches
Series
Submitter
State
any
Action Required
New
Under Review
Accepted
Rejected
RFC
Not Applicable
Changes Requested
Awaiting Upstream
Superseded
Deferred
Search
Archived
No
Yes
Both
Delegate
------
Nobody
gitpwbot
gitpwbot
gitpwbot
gitpwbot
gitpwbot
gitpwbot
gitpwbot
gitpwbot
mototimo
mototimo
mototimo
kraj
kraj
denix
denix
reatmon
reatmon
rpurdie
rpurdie
rpurdie
rpurdie
sakoman
ycongal_smile
ycongal_smile
ycongal_smile
rossburton
rossburton
jonmason
abelloni
abelloni
agodard
mathieu
anujm
fatho
fatho
fatho
boucman
boucman
boucman
Apply
«
1
2
...
9
10
11
…
172
173
»
Patch
Series
A/R/T
S/W/F
Date
Submitter
Delegate
State
[v2] spdx_common.py: Avoid crash when this_dep.taskhash_deps is None
[v2] spdx_common.py: Avoid crash when this_dep.taskhash_deps is None
- - -
-
-
-
2026-08-05
Mike Looijmans
Changes Requested
spdx_common.py: Avoid crash when this_dep.taskhash_deps is None
spdx_common.py: Avoid crash when this_dep.taskhash_deps is None
- - -
-
-
-
2026-08-05
Mike Looijmans
Changes Requested
[AUH] python3-pip: upgrading to 26.2.1 SUCCEEDED
[AUH] python3-pip: upgrading to 26.2.1 SUCCEEDED
- - -
-
-
-
2026-08-05
auh@yoctoproject.org
New
[AUH] python3-mako: upgrading to 1.4.0 SUCCEEDED
[AUH] python3-mako: upgrading to 1.4.0 SUCCEEDED
- - -
-
-
-
2026-08-05
auh@yoctoproject.org
New
[AUH] repo: upgrading to 2.66 SUCCEEDED
[AUH] repo: upgrading to 2.66 SUCCEEDED
- - -
-
-
-
2026-08-05
auh@yoctoproject.org
New
[AUH] python3-packaging: upgrading to 26.3 SUCCEEDED
[AUH] python3-packaging: upgrading to 26.3 SUCCEEDED
- - -
-
-
-
2026-08-05
auh@yoctoproject.org
New
[AUH] python3-hypothesis: upgrading to 6.165.1 FAILED
[AUH] python3-hypothesis: upgrading to 6.165.1 FAILED
- - -
-
-
-
2026-08-05
auh@yoctoproject.org
New
[AUH] python3-flit-core: upgrading to 4.0.2 FAILED
[AUH] python3-flit-core: upgrading to 4.0.2 FAILED
- - -
-
-
-
2026-08-05
auh@yoctoproject.org
New
[AUH] libxfont2: upgrading to 2.0.9 SUCCEEDED
[AUH] libxfont2: upgrading to 2.0.9 SUCCEEDED
- - -
-
-
-
2026-08-05
auh@yoctoproject.org
New
[4/4] bitbake.conf, rust-common.bbclass: include RUST_BUILD_SYS in the task hash
[1/4] libtool: strip build system triplet from installed libtool script
- - -
-
-
-
2026-08-04
Alejandro Hernandez
Changes Requested
[3/4] python_pep517.bbclass: always export _PYTHON_HOST_PLATFORM for wheel tag
[1/4] libtool: strip build system triplet from installed libtool script
- - -
-
-
-
2026-08-04
Alejandro Hernandez
Changes Requested
[6/9] ffmpeg: upgrade 8.1.2 -> 9.0
[1/9] libva-utils: 2.23.0 -> 2.24.0
- - -
-
-
-
2026-08-04
Richard Purdie
Changes Requested
libtool: upgrade 2.5.4 -> 2.6.2
libtool: upgrade 2.5.4 -> 2.6.2
- - -
-
-
-
2026-08-04
Jaipaul Cheernam
Changes Requested
classes/sbom-cve-check: fall back to the stable SBOM symlink
classes/sbom-cve-check: fall back to the stable SBOM symlink
- - -
-
-
-
2026-08-04
Thomas Roos
Changes Requested
[AUH] ffmpeg: upgrading to 9.0 SUCCEEDED
[AUH] ffmpeg: upgrading to 9.0 SUCCEEDED
- - -
-
-
-
2026-08-04
auh@yoctoproject.org
New
[AUH] python3-pyproject-metadata: upgrading to 0.12.1 SUCCEEDED
[AUH] python3-pyproject-metadata: upgrading to 0.12.1 SUCCEEDED
- - -
-
-
-
2026-08-04
auh@yoctoproject.org
New
[AUH] python3-sbom-cve-check: upgrading to 1.3.3 SUCCEEDED
[AUH] python3-sbom-cve-check: upgrading to 1.3.3 SUCCEEDED
- - -
-
-
-
2026-08-04
auh@yoctoproject.org
New
[AUH] libadwaita: upgrading to 1.9.3 SUCCEEDED
[AUH] libadwaita: upgrading to 1.9.3 SUCCEEDED
- - -
-
-
-
2026-08-04
auh@yoctoproject.org
New
[AUH] lua: upgrading to 5.5.1 FAILED
[AUH] lua: upgrading to 5.5.1 FAILED
- - -
-
-
-
2026-08-04
auh@yoctoproject.org
New
[AUH] python3-cffi: upgrading to 2.1.1 SUCCEEDED
[AUH] python3-cffi: upgrading to 2.1.1 SUCCEEDED
- - -
-
-
-
2026-08-04
auh@yoctoproject.org
New
[v2,2/3] devtool: upgrade: read changelog blobs via a temp file
devtool: upgrade: improve changelog extraction for git-log-style ChangeLogs
- - -
-
-
-
2026-08-04
Daniel Turull
Accepted
[v12,8/8] rpm: filter /usr/bin/pkg-config from RPM auto-generated Requires
rpm: 4.20.1 -> 6.0.2
- - -
-
-
-
2026-08-04
Gavini, Sumanth
Changes Requested
[v12,7/8] libarchive: Make it work with rpm 6.0.2
rpm: 4.20.1 -> 6.0.2
- - -
-
-
-
2026-08-04
Gavini, Sumanth
Changes Requested
[v12,6/8] rpm: 4.20.1 -> 6.0.2
rpm: 4.20.1 -> 6.0.2
- - -
-
-
-
2026-08-04
Gavini, Sumanth
Changes Requested
[v12,5/8] target-sdk-provides-dummy: Add pkg-config to DUMMYPROVIDES
rpm: 4.20.1 -> 6.0.2
- - -
-
-
-
2026-08-04
Gavini, Sumanth
Changes Requested
[v12,4/8] lib/oe/package.py: Don't redirect stderr
rpm: 4.20.1 -> 6.0.2
- - -
-
-
-
2026-08-04
Gavini, Sumanth
Changes Requested
[v12,3/8] lib/oe/package.py: Don't add ldconfig_postinst_fragment for glibc or musl
rpm: 4.20.1 -> 6.0.2
- - -
-
-
-
2026-08-04
Gavini, Sumanth
Changes Requested
[v12,2/8] package_rpm.bbclass: Define _lib and _libdir for rpmbuild
rpm: 4.20.1 -> 6.0.2
- - -
-
-
-
2026-08-04
Gavini, Sumanth
Changes Requested
[v12,1/8] package_rpm.bbclass: Drop external dependency generator to support rpm 6
rpm: 4.20.1 -> 6.0.2
- - -
-
-
-
2026-08-04
Gavini, Sumanth
Changes Requested
[8/8] xwininfo,xvinfo,xmodmap: upgrade 1.1.6 -> 1.1.7,1.1.5 -> 1.1.6,1.0.11 -> 1.0.12xwininfo,xvinf…
[1/8] gn: upgrade to latest revision
- - -
-
-
-
2026-08-04
Wang Mingyu
Superseded
[v1] libpng: ptest: disable for riscv64 due to timeout
[v1] libpng: ptest: disable for riscv64 due to timeout
- - -
-
-
-
2026-08-03
Pratik Farkase
Changes Requested
[v2,10/10] cve-exclusion: set status for CVE-2023-6240
cve-exclusion: triage ten kernel CVEs lacking upstream fix data
- - -
-
-
-
2026-08-03
Junjie Cao
Changes Requested
[v2,09/10] cve-exclusion: set status for CVE-2023-6238
cve-exclusion: triage ten kernel CVEs lacking upstream fix data
- - -
-
-
-
2026-08-03
Junjie Cao
Changes Requested
[v2,08/10] cve-exclusion: set status for CVE-2023-4010
cve-exclusion: triage ten kernel CVEs lacking upstream fix data
- - -
-
-
-
2026-08-03
Junjie Cao
Changes Requested
[v2,07/10] cve-exclusion: set status for CVE-2023-3397
cve-exclusion: triage ten kernel CVEs lacking upstream fix data
- - -
-
-
-
2026-08-03
Junjie Cao
Changes Requested
[v2,06/10] cve-exclusion: set status for CVE-2022-4543
cve-exclusion: triage ten kernel CVEs lacking upstream fix data
- - -
-
-
-
2026-08-03
Junjie Cao
Changes Requested
[v2,05/10] cve-exclusion: set status for CVE-2022-1247
cve-exclusion: triage ten kernel CVEs lacking upstream fix data
- - -
-
-
-
2026-08-03
Junjie Cao
Changes Requested
[v2,04/10] cve-exclusion: set status for CVE-2022-0400
cve-exclusion: triage ten kernel CVEs lacking upstream fix data
- - -
-
-
-
2026-08-03
Junjie Cao
Changes Requested
[v2,03/10] cve-exclusion: set status for CVE-2021-3864
cve-exclusion: triage ten kernel CVEs lacking upstream fix data
- - -
-
-
-
2026-08-03
Junjie Cao
Changes Requested
[v2,02/10] cve-exclusion: set status for CVE-2021-3714
cve-exclusion: triage ten kernel CVEs lacking upstream fix data
- - -
-
-
-
2026-08-03
Junjie Cao
Changes Requested
[v2,01/10] cve-exclusion: set status for CVE-2019-14899
cve-exclusion: triage ten kernel CVEs lacking upstream fix data
- - -
-
-
-
2026-08-03
Junjie Cao
Changes Requested
audit: Move 4.1.4 from meta-openembedded
audit: Move 4.1.4 from meta-openembedded
- - -
-
-
-
2026-08-03
Jörg Sommer
Changes Requested
[AUH] mpg123: upgrading to 1.33.7 SUCCEEDED
[AUH] mpg123: upgrading to 1.33.7 SUCCEEDED
- - -
-
-
-
2026-08-03
auh@yoctoproject.org
New
[2/2] qemboot: Correct task dependency tree
[1/2] coreutils: Backport a fix recommended by upstream
- - -
-
-
-
2026-08-02
Richard Purdie
Accepted
[01/14] qemuboot: make do_write_qemuboot_conf a standalone sstate task
devtool ide-sdk: clang and lldb support
- - -
-
-
-
2026-08-02
AdrianF
Changes Requested
cve-exclusion: set status for 7 kernel CVEs lacking upstream fix data
cve-exclusion: set status for 7 kernel CVEs lacking upstream fix data
- - -
-
-
-
2026-08-02
Junjie Cao
Changes Requested
[AUH] libmicrohttpd: upgrading to 1.0.9 SUCCEEDED
[AUH] libmicrohttpd: upgrading to 1.0.9 SUCCEEDED
- - -
-
-
-
2026-08-02
auh@yoctoproject.org
New
[AUH] libpsl: upgrading to 0.23.1 SUCCEEDED
[AUH] libpsl: upgrading to 0.23.1 SUCCEEDED
- - -
-
-
-
2026-08-02
auh@yoctoproject.org
New
[AUH] at-spi2-core: upgrading to 2.60.6 SUCCEEDED
[AUH] at-spi2-core: upgrading to 2.60.6 SUCCEEDED
- - -
-
-
-
2026-08-02
auh@yoctoproject.org
New
[AUH] python3-pyopenssl: upgrading to 26.4.0 SUCCEEDED
[AUH] python3-pyopenssl: upgrading to 26.4.0 SUCCEEDED
- - -
-
-
-
2026-08-02
auh@yoctoproject.org
New
[AUH] pkgconf: upgrading to 3.0.5 SUCCEEDED
[AUH] pkgconf: upgrading to 3.0.5 SUCCEEDED
- - -
-
-
-
2026-08-02
auh@yoctoproject.org
New
[AUH] python3-hypothesis: upgrading to 6.165.0 FAILED
[AUH] python3-hypothesis: upgrading to 6.165.0 FAILED
- - -
-
-
-
2026-08-02
auh@yoctoproject.org
New
[AUH] hwdata: upgrading to 0.410 SUCCEEDED
[AUH] hwdata: upgrading to 0.410 SUCCEEDED
- - -
-
-
-
2026-08-01
auh@yoctoproject.org
New
[AUH] spirv-llvm-translator: upgrading to 22.1.5 SUCCEEDED
[AUH] spirv-llvm-translator: upgrading to 22.1.5 SUCCEEDED
- - -
-
-
-
2026-08-01
auh@yoctoproject.org
New
[AUH] python3-websockets: upgrading to 17.0.1 SUCCEEDED
[AUH] python3-websockets: upgrading to 17.0.1 SUCCEEDED
- - -
-
-
-
2026-08-01
auh@yoctoproject.org
New
[AUH] msmtp: upgrading to 1.8.34 SUCCEEDED
[AUH] msmtp: upgrading to 1.8.34 SUCCEEDED
- - -
-
-
-
2026-08-01
auh@yoctoproject.org
New
[AUH] harfbuzz: upgrading to 14.3.0 SUCCEEDED
[AUH] harfbuzz: upgrading to 14.3.0 SUCCEEDED
- - -
-
-
-
2026-08-01
auh@yoctoproject.org
New
[AUH] python3-uv-build: upgrading to 0.12.1 SUCCEEDED
[AUH] python3-uv-build: upgrading to 0.12.1 SUCCEEDED
- - -
-
-
-
2026-08-01
auh@yoctoproject.org
New
[AUH] ttyrun: upgrading to 2.44.0 SUCCEEDED
[AUH] ttyrun: upgrading to 2.44.0 SUCCEEDED
- - -
-
-
-
2026-08-01
auh@yoctoproject.org
New
[AUH] cmake,cmake-native: upgrading to 4.4.2,4.4.2 SUCCEEDED
[AUH] cmake,cmake-native: upgrading to 4.4.2,4.4.2 SUCCEEDED
- - -
-
-
-
2026-08-01
auh@yoctoproject.org
New
[v5,6/6] wic: gate syslinux-native on the target, not the build host
wic: ship the tools it invokes
- - -
-
-
-
2026-07-31
Trevor Woerner
Changes Requested
[v5,2/6] wic: add a shared helper tool list
wic: ship the tools it invokes
- - -
-
-
-
2026-07-31
Trevor Woerner
Changes Requested
glibc: Ignore CVE-2026-5358
glibc: Ignore CVE-2026-5358
- - -
-
-
-
2026-07-31
Adarsh Jagadish Kamini
Rejected
[v3] glib-2.0,glib-2.0-initial: upgrade 2.88.2 -> 2.88.3,2.88.2 -> 2.88.3
[v3] glib-2.0,glib-2.0-initial: upgrade 2.88.2 -> 2.88.3,2.88.2 -> 2.88.3
- - -
-
-
-
2026-07-31
Jaipaul Cheernam
Accepted
[v4,5/5] oeqa/selftest/devtool: Add test for multiple nested git destsuffix repos
devtool: fix standalone clone conversion for nested git repos
- - -
-
-
-
2026-07-31
Jamin Lin
Changes Requested
[v4,4/5] meta-selftest: Add devtool-test-multi-destsuffix recipe
devtool: fix standalone clone conversion for nested git repos
- - -
-
-
-
2026-07-31
Jamin Lin
Changes Requested
[v4,3/5] devtool-source: Make nested destsuffix git repos standalone
devtool: fix standalone clone conversion for nested git repos
- - -
-
-
-
2026-07-31
Jamin Lin
Changes Requested
[v4,2/5] devtool: Register nested git repos before the initial commit
devtool: fix standalone clone conversion for nested git repos
- - -
-
-
-
2026-07-31
Jamin Lin
Changes Requested
[v4,1/5] oe/patch: Skip commitIgnored when nothing is actually staged
devtool: fix standalone clone conversion for nested git repos
- - -
-
-
-
2026-07-31
Jamin Lin
Changes Requested
[AUH] python3-markdown: upgrading to 3.10.3 SUCCEEDED
[AUH] python3-markdown: upgrading to 3.10.3 SUCCEEDED
- - -
-
-
-
2026-07-31
auh@yoctoproject.org
New
[AUH] diffoscope: upgrading to 326 SUCCEEDED
[AUH] diffoscope: upgrading to 326 SUCCEEDED
- - -
-
-
-
2026-07-31
auh@yoctoproject.org
New
[AUH] python3-hypothesis: upgrading to 6.164.0 FAILED
[AUH] python3-hypothesis: upgrading to 6.164.0 FAILED
- - -
-
-
-
2026-07-31
auh@yoctoproject.org
New
[v2] glib-2.0,glib-2.0-initial: upgrade 2.88.2 -> 2.88.3,2.88.2 -> 2.88.3
[v2] glib-2.0,glib-2.0-initial: upgrade 2.88.2 -> 2.88.3,2.88.2 -> 2.88.3
- - -
-
-
-
2026-07-30
Jaipaul Cheernam
Superseded
glib-2.0,glib-2.0-initial: upgrade 2.88.2 -> 2.88.3,2.88.2 -> 2.88.3
glib-2.0,glib-2.0-initial: upgrade 2.88.2 -> 2.88.3,2.88.2 -> 2.88.3
- - -
-
-
-
2026-07-30
Jaipaul Cheernam
Superseded
[AUH] pseudo: upgrading to 1.9.10 FAILED
[AUH] pseudo: upgrading to 1.9.10 FAILED
- - -
-
-
-
2026-07-30
auh@yoctoproject.org
New
[AUH] python3-pip: upgrading to 26.2 SUCCEEDED
[AUH] python3-pip: upgrading to 26.2 SUCCEEDED
- - -
-
-
-
2026-07-30
auh@yoctoproject.org
New
[AUH] nghttp2: upgrading to 1.70.0 SUCCEEDED
[AUH] nghttp2: upgrading to 1.70.0 SUCCEEDED
- - -
-
-
-
2026-07-30
auh@yoctoproject.org
New
[AUH] nfs-utils: upgrading to 2.9.2 FAILED
[AUH] nfs-utils: upgrading to 2.9.2 FAILED
- - -
-
-
-
2026-07-30
auh@yoctoproject.org
New
[AUH] python3-websockets: upgrading to 17.0 SUCCEEDED
[AUH] python3-websockets: upgrading to 17.0 SUCCEEDED
- - -
-
-
-
2026-07-30
auh@yoctoproject.org
New
[AUH] barebox-tools: upgrading to 2026.07.0 SUCCEEDED
[AUH] barebox-tools: upgrading to 2026.07.0 SUCCEEDED
- - -
-
-
-
2026-07-30
auh@yoctoproject.org
New
[AUH] mesa,mesa-tools-native: upgrading to 26.1.6,26.1.6 SUCCEEDED
[AUH] mesa,mesa-tools-native: upgrading to 26.1.6,26.1.6 SUCCEEDED
- - -
-
-
-
2026-07-30
auh@yoctoproject.org
New
[AUH] glib-2.0,glib-2.0-initial: upgrading to 2.88.3,2.88.3 FAILED
[AUH] glib-2.0,glib-2.0-initial: upgrading to 2.88.3,2.88.3 FAILED
- - -
-
-
-
2026-07-30
auh@yoctoproject.org
New
[v11,9/9] rpm: filter /usr/bin/pkg-config from RPM auto-generated Requires
rpm: 4.20.1 -> 6.0.2
- - -
-
-
-
2026-07-29
Gavini, Sumanth
Superseded
[v11,8/9] libarchive: Make it work with rpm 6
rpm: 4.20.1 -> 6.0.2
- - -
-
-
-
2026-07-29
Gavini, Sumanth
Superseded
[v11,7/9] rpm: 4.20.1 -> 6.0.2
rpm: 4.20.1 -> 6.0.2
- - -
-
-
-
2026-07-29
Gavini, Sumanth
Superseded
[v11,6/9] target-sdk-provides-dummy: Add pkg-config to DUMMYPROVIDES
rpm: 4.20.1 -> 6.0.2
- - -
-
-
-
2026-07-29
Gavini, Sumanth
Superseded
[v11,5/9] lib/oe/package.py: Don't redirect stderr
rpm: 4.20.1 -> 6.0.2
- - -
-
-
-
2026-07-29
Gavini, Sumanth
Superseded
[v11,4/9] lib/oe/package.py: Filter out /usr/bin/pkg-config file dependency
rpm: 4.20.1 -> 6.0.2
- - -
-
-
-
2026-07-29
Gavini, Sumanth
Superseded
[v11,3/9] lib/oe/package.py: Don't add ldconfig_postinst_fragment for glibc or musl
rpm: 4.20.1 -> 6.0.2
- - -
-
-
-
2026-07-29
Gavini, Sumanth
Superseded
[v11,2/9] package_rpm.bbclass: Define _lib and _libdir for rpmbuild
rpm: 4.20.1 -> 6.0.2
- - -
-
-
-
2026-07-29
Gavini, Sumanth
Superseded
[v11,1/9] package_rpm.bbclass: Drop external dependency generator to support rpm 6
rpm: 4.20.1 -> 6.0.2
- - -
-
-
-
2026-07-29
Gavini, Sumanth
Superseded
[v2,5/5] docs: add container-yocto-builder.md
[v2,1/5] vcontainer-bbmask.inc: add python3-pexpect,-ptyprocess
- - -
-
-
-
2026-07-29
Tim Orling
Rejected
[v2,1/5] vcontainer-bbmask.inc: add python3-pexpect,-ptyprocess
[v2,1/5] vcontainer-bbmask.inc: add python3-pexpect,-ptyprocess
- - -
-
-
-
2026-07-29
Tim Orling
Rejected
[4/9] python3-uv-build: upgrade 0.11.32 -> 0.12.0
[1/9] cmake: upgrade 4.4.0 -> 4.4.1
- - -
-
-
-
2026-07-29
Richard Purdie
Accepted
[AUH] vulkan-validation-layers: upgrading to 1.4.357.0 FAILED
[AUH] vulkan-validation-layers: upgrading to 1.4.357.0 FAILED
- - -
-
-
-
2026-07-29
auh@yoctoproject.org
New
[AUH] spirv-tools: upgrading to 1.4.357.0 FAILED
[AUH] spirv-tools: upgrading to 1.4.357.0 FAILED
- - -
-
-
-
2026-07-29
auh@yoctoproject.org
New
[AUH] vulkan-utility-libraries: upgrading to 1.4.357.0 FAILED
[AUH] vulkan-utility-libraries: upgrading to 1.4.357.0 FAILED
- - -
-
-
-
2026-07-29
auh@yoctoproject.org
New
[AUH] vulkan-tools: upgrading to 1.4.357.0 FAILED
[AUH] vulkan-tools: upgrading to 1.4.357.0 FAILED
- - -
-
-
-
2026-07-29
auh@yoctoproject.org
New
[AUH] vulkan-loader: upgrading to 1.4.357.0 FAILED
[AUH] vulkan-loader: upgrading to 1.4.357.0 FAILED
- - -
-
-
-
2026-07-29
auh@yoctoproject.org
New
[AUH] vulkan-volk: upgrading to 1.4.357.0 SUCCEEDED
[AUH] vulkan-volk: upgrading to 1.4.357.0 SUCCEEDED
- - -
-
-
-
2026-07-29
auh@yoctoproject.org
New
«
1
2
...
9
10
11
…
172
173
»