Toggle navigation
Patchwork
OpenEmbedded Core Layer
Patches
Bundles
About this project
Login
Register
Mail settings
Show patches with
: State =
Action Required
| Archived =
No
| 15788 patches
Series
Submitter
State
any
Action Required
New
Under Review
Accepted
Rejected
RFC
Not Applicable
Changes Requested
Awaiting Upstream
Superseded
Deferred
Search
Archived
No
Yes
Both
Delegate
------
Nobody
gitpwbot
gitpwbot
gitpwbot
gitpwbot
gitpwbot
gitpwbot
gitpwbot
gitpwbot
mototimo
mototimo
mototimo
kraj
kraj
denix
denix
reatmon
reatmon
rpurdie
rpurdie
rpurdie
rpurdie
sakoman
ycongal_smile
ycongal_smile
ycongal_smile
rossburton
rossburton
jonmason
abelloni
abelloni
agodard
mathieu
trukna
anujm
fatho
fatho
fatho
boucman
boucman
boucman
Apply
«
1
2
3
4
…
157
158
»
Patch
Series
A/R/T
S/W/F
Date
Submitter
Delegate
State
[RFC,4/4] multilib_header: wrap musl headers for multilib builds
musl multilib: loader path and headers
- - -
-
-
-
2026-10-29
mark.yang
New
[RFC,3/4] multilib_header_wrapper.h: support musl
musl multilib: loader path and headers
- - -
-
-
-
2026-10-29
mark.yang
New
[RFC,2/4] musl: wrap the bits headers for multilib
musl multilib: loader path and headers
- - -
-
-
-
2026-10-29
mark.yang
New
[RFC,1/4] gcc: point the musl dynamic linker at nonarch_base_libdir
musl multilib: loader path and headers
- - -
-
-
-
2026-10-29
mark.yang
New
[wrynose,v2,3/3] lrzsz: fix CVE-2026-105842
[wrynose,v2,1/3] lrzsz: fix CVE-2026-105841
- - -
-
-
-
2026-10-29
Hetvi Thakar -X (hthakar - E INFOCHIPS PRIVATE LIMITED at Cisco)
New
[wrynose,v2,2/3] lrzsz: fix CVE-2026-105840
[wrynose,v2,1/3] lrzsz: fix CVE-2026-105841
- - -
-
-
-
2026-10-29
Hetvi Thakar -X (hthakar - E INFOCHIPS PRIVATE LIMITED at Cisco)
New
[wrynose,v2,1/3] lrzsz: fix CVE-2026-105841
[wrynose,v2,1/3] lrzsz: fix CVE-2026-105841
- - -
-
-
-
2026-10-29
Hetvi Thakar -X (hthakar - E INFOCHIPS PRIVATE LIMITED at Cisco)
New
[v2,2/2] python3-pytest: upgrade 9.1.1 -> 9.2.0
[v2,1/2] python3-unittest-automake-output: fix pytest 9.2.0 trylast deprecation
- - -
-
-
-
2026-10-29
Jaipaul Cheernam
Under Review
[v2,1/2] python3-unittest-automake-output: fix pytest 9.2.0 trylast deprecation
[v2,1/2] python3-unittest-automake-output: fix pytest 9.2.0 trylast deprecation
- - -
-
-
-
2026-10-29
Jaipaul Cheernam
Under Review
[scarthgap,v4,5/5] apr-util: Fix CVE-2026-34502
[scarthgap,v4,1/5] apr-util: Fix CVE-2025-49506
- - -
-
-
-
2026-10-29
Hetvi Thakar -X (hthakar - E INFOCHIPS PRIVATE LIMITED at Cisco)
ycongal_smile
Under Review
[scarthgap,v4,4/5] apr-util: Fix CVE-2026-34501
[scarthgap,v4,1/5] apr-util: Fix CVE-2025-49506
- - -
-
-
-
2026-10-29
Hetvi Thakar -X (hthakar - E INFOCHIPS PRIVATE LIMITED at Cisco)
ycongal_smile
Under Review
[scarthgap,v4,3/5] apr-util: Mark CVE-2026-34191 not applicable
[scarthgap,v4,1/5] apr-util: Fix CVE-2025-49506
- - -
-
-
-
2026-10-29
Hetvi Thakar -X (hthakar - E INFOCHIPS PRIVATE LIMITED at Cisco)
ycongal_smile
Under Review
[scarthgap,v4,2/5] apr-util: Fix CVE-2026-32327
[scarthgap,v4,1/5] apr-util: Fix CVE-2025-49506
- - -
-
-
-
2026-10-29
Hetvi Thakar -X (hthakar - E INFOCHIPS PRIVATE LIMITED at Cisco)
ycongal_smile
Under Review
[scarthgap,v4,1/5] apr-util: Fix CVE-2025-49506
[scarthgap,v4,1/5] apr-util: Fix CVE-2025-49506
- - -
-
-
-
2026-10-29
Hetvi Thakar -X (hthakar - E INFOCHIPS PRIVATE LIMITED at Cisco)
ycongal_smile
Under Review
[v2] maintainers.inc: add RECIPE_UPGRADE_CHANGELOG_SKIP
[v2] maintainers.inc: add RECIPE_UPGRADE_CHANGELOG_SKIP
- - -
-
-
-
2026-10-29
Daniel Turull
Under Review
[v5] igt-gpu-tools: fix build on non-x86 platforms
[v5] igt-gpu-tools: fix build on non-x86 platforms
- - -
-
-
-
2026-10-29
Jose Quaresma
Under Review
[v4] igt-gpu-tools: fix build on non-x86 platforms
[v4] igt-gpu-tools: fix build on non-x86 platforms
- - -
-
-
-
2026-10-29
Jose Quaresma
New
spdx30_tasks: include the SDK target packages in the SDK SBOM
spdx30_tasks: include the SDK target packages in the SDK SBOM
- - -
-
-
-
2026-10-29
Prasanth R
Under Review
[4/4] cracklib: upgrade 2.10.3 -> 2.10.4
[1/4] tzdata/tzcode-native: upgrade 2026e -> 2026f
- - -
-
-
-
2026-10-29
Ankur Tyagi
Under Review
[3/4] glib-networking: upgrade 2.90.0 -> 2.90.1
[1/4] tzdata/tzcode-native: upgrade 2026e -> 2026f
- - -
-
-
-
2026-10-29
Ankur Tyagi
Under Review
[2/4] aspell: upgrade 0.60.8.2 -> 0.60.8.3
[1/4] tzdata/tzcode-native: upgrade 2026e -> 2026f
- - -
-
-
-
2026-10-29
Ankur Tyagi
Under Review
[1/4] tzdata/tzcode-native: upgrade 2026e -> 2026f
[1/4] tzdata/tzcode-native: upgrade 2026e -> 2026f
- - -
-
-
-
2026-10-29
Ankur Tyagi
Under Review
[v3,3/3] openssl: Upgrade 4.0.3 -> 4.1.0
openssl: Upgrade 4.0.3 -> 4.1.0 and dependencies update
- - -
-
-
-
2026-10-29
Jaipaul Cheernam
Under Review
[v3,2/3] python3-pyopenssl: Add patch to return None for TLS 1.3
openssl: Upgrade 4.0.3 -> 4.1.0 and dependencies update
- - -
-
-
-
2026-10-29
Jaipaul Cheernam
Under Review
[v3,1/3] python3-cryptography: backport InvalidTag fix for openssl 4.1.0
openssl: Upgrade 4.0.3 -> 4.1.0 and dependencies update
- - -
-
-
-
2026-10-29
Jaipaul Cheernam
Under Review
[scarthgap,PATCHv5] vim: Fix for CVE-2026-73076
[scarthgap,PATCHv5] vim: Fix for CVE-2026-73076
- - -
-
-
-
2026-10-29
Hitendra Prajapati
ycongal_smile
Under Review
kernel-grub.bbclass: use KERNEL_PACKAGE_NAME for the image packages
kernel-grub.bbclass: use KERNEL_PACKAGE_NAME for the image packages
- - -
-
-
-
2026-10-29
Prasanth R
New
[v2] kernel.bbclass: fix -dev files when KERNEL_PACKAGE_NAME is PN
[v2] kernel.bbclass: fix -dev files when KERNEL_PACKAGE_NAME is PN
- - -
-
-
-
2026-10-29
Prasanth R
New
[AUH] appstream: upgrading to 1.2.2 SUCCEEDED
[AUH] appstream: upgrading to 1.2.2 SUCCEEDED
- - -
-
-
-
2026-10-29
auh@yoctoproject.org
New
[AUH] python3-hypothesis: upgrading to 6.170.13 SUCCEEDED
[AUH] python3-hypothesis: upgrading to 6.170.13 SUCCEEDED
- - -
-
-
-
2026-10-29
auh@yoctoproject.org
New
[AUH] dbus-glib: upgrading to 0.116 SUCCEEDED
[AUH] dbus-glib: upgrading to 0.116 SUCCEEDED
- - -
-
-
-
2026-10-29
auh@yoctoproject.org
New
[AUH] cracklib: upgrading to 2.10.4 FAILED
[AUH] cracklib: upgrading to 2.10.4 FAILED
- - -
-
-
-
2026-10-29
auh@yoctoproject.org
New
[AUH] aspell: upgrading to 0.60.8.3 SUCCEEDED
[AUH] aspell: upgrading to 0.60.8.3 SUCCEEDED
- - -
-
-
-
2026-10-29
auh@yoctoproject.org
New
[AUH] tzcode-native,tzdata: upgrading to 2026f FAILED
[AUH] tzcode-native,tzdata: upgrading to 2026f FAILED
- - -
-
-
-
2026-10-29
auh@yoctoproject.org
New
[AUH] mesa-tools-native,mesa: upgrading to 26.2.6 SUCCEEDED
[AUH] mesa-tools-native,mesa: upgrading to 26.2.6 SUCCEEDED
- - -
-
-
-
2026-10-29
auh@yoctoproject.org
New
[v2] kernel.bbclass: fix -dev files when KERNEL_PACKAGE_NAME is PN
[v2] kernel.bbclass: fix -dev files when KERNEL_PACKAGE_NAME is PN
- - -
-
-
-
2026-10-29
Prasanth R
Under Review
[meta-yocto-bsp,scarthgap,07/07] yocto-bsps: update to v6.6.160
linux-yocto/6.6: -stable updates and aufs refresh
- - -
-
-
-
2026-10-29
Bruce Ashfield
New
[meta-yocto-bsp,scarthgap,06/07] yocto-bsps: update to v6.6.159
linux-yocto/6.6: -stable updates and aufs refresh
- - -
-
-
-
2026-10-29
Bruce Ashfield
New
[meta,scarthgap,05/07] linux-yocto/6.6: aufs: refresh to upstream aufs6.6.84
linux-yocto/6.6: -stable updates and aufs refresh
- - -
-
-
-
2026-10-29
Bruce Ashfield
New
[meta,scarthgap,04/07] linux-yocto/6.6: update to v6.6.160
linux-yocto/6.6: -stable updates and aufs refresh
- - -
-
-
-
2026-10-29
Bruce Ashfield
New
[meta,scarthgap,03/07] linux-yocto/6.6: update to v6.6.159
linux-yocto/6.6: -stable updates and aufs refresh
- - -
-
-
-
2026-10-29
Bruce Ashfield
New
[meta,scarthgap,02/07] linux-yocto/6.6: update to v6.6.157
linux-yocto/6.6: -stable updates and aufs refresh
- - -
-
-
-
2026-10-29
Bruce Ashfield
New
[meta,scarthgap,01/07] linux-yocto/6.6: update to v6.6.156
linux-yocto/6.6: -stable updates and aufs refresh
- - -
-
-
-
2026-10-29
Bruce Ashfield
New
[meta-yocto-bsp,11/11] yocto-bsps: update to v7.2.13
linux-yocto: consolidated pull request
- - -
-
-
-
2026-10-29
Bruce Ashfield
New
[meta-yocto-bsp,10/11] yocto-bsps: update to v6.18.59
linux-yocto: consolidated pull request
- - -
-
-
-
2026-10-29
Bruce Ashfield
New
[meta-yocto-bsp,09/11] yocto-bsps: update to v7.2.11
linux-yocto: consolidated pull request
- - -
-
-
-
2026-10-29
Bruce Ashfield
New
[meta-yocto-bsp,08/11] yocto-bsps: update to v6.18.57
linux-yocto: consolidated pull request
- - -
-
-
-
2026-10-29
Bruce Ashfield
New
[meta,07/11] linux-yocto/7.2: yaffs2: backport upstream fixes and restore remount handling
linux-yocto: consolidated pull request
- - -
-
-
-
2026-10-29
Bruce Ashfield
New
[meta,06/11] linux-yocto/7.2: update to v7.2.13
linux-yocto: consolidated pull request
- - -
-
-
-
2026-10-29
Bruce Ashfield
New
[meta,05/11] linux-yocto/6.18: update to v6.18.59
linux-yocto: consolidated pull request
- - -
-
-
-
2026-10-29
Bruce Ashfield
New
[meta,04/11] linux-yocto/7.2: update to v7.2.11
linux-yocto: consolidated pull request
- - -
-
-
-
2026-10-29
Bruce Ashfield
New
[meta,03/11] linux-yocto/6.18: update to v6.18.57
linux-yocto: consolidated pull request
- - -
-
-
-
2026-10-29
Bruce Ashfield
New
[meta,02/11] linux-yocto/7.2: aufs: refresh to upstream aufs7.2
linux-yocto: consolidated pull request
- - -
-
-
-
2026-10-29
Bruce Ashfield
New
[meta,01/11] linux-yocto/6.18: aufs: refresh to upstream aufs6.18
linux-yocto: consolidated pull request
- - -
-
-
-
2026-10-29
Bruce Ashfield
New
kernel-grub.bbclass: use KERNEL_PACKAGE_NAME for the image packages
kernel-grub.bbclass: use KERNEL_PACKAGE_NAME for the image packages
- - -
-
-
-
2026-10-29
Prasanth R
Under Review
kernel.bbclass: fix -dev files when KERNEL_PACKAGE_NAME is PN
kernel.bbclass: fix -dev files when KERNEL_PACKAGE_NAME is PN
- - -
-
-
-
2026-10-29
Prasanth R
New
[v7,8/8] ovmf: Allow empty SPDX deploy artifacts
Implement SPDX for deploy tasks
- - -
-
-
-
2026-10-28
Joshua Watt
Under Review
[v7,7/8] layer.conf: Fix initramfs-framework not knowing which udev it has
Implement SPDX for deploy tasks
- - -
-
-
-
2026-10-28
Joshua Watt
Under Review
[v7,6/8] spdx: Replace do_create_image_spdx with deploy task
Implement SPDX for deploy tasks
- - -
-
-
-
2026-10-28
Joshua Watt
Under Review
[v7,5/8] classes-recipe/deploy: Add do_deploy to SPDX_DEPLOY_TASKS
Implement SPDX for deploy tasks
- - -
-
-
-
2026-10-28
Joshua Watt
Under Review
[v7,4/8] classes-global/sstate: Keep SPDX generating setscene dependencies
Implement SPDX for deploy tasks
- - -
-
-
-
2026-10-28
Joshua Watt
Under Review
[v7,3/8] oeqa: Add SPDX deploy SBoM test
Implement SPDX for deploy tasks
- - -
-
-
-
2026-10-28
Joshua Watt
Under Review
[v7,2/8] spdx: Add ability for deploy tasks to create SPDX
Implement SPDX for deploy tasks
- - -
-
-
-
2026-10-28
Joshua Watt
Under Review
[v7,1/8] spdx: Skip dependencies that are not in the taskhash
Implement SPDX for deploy tasks
- - -
-
-
-
2026-10-28
Joshua Watt
Under Review
[wrynose,v3] python3-pip: patch the vendored python3-certifi
[wrynose,v3] python3-pip: patch the vendored python3-certifi
- - -
-
-
-
2026-10-28
Jeroen Hofstee
New
[3/3] kernel-fit-image: drop the synthetic FIT_LOADABLE_* values
oeqa/utils/commands: add get_bb_vars_flags and build get_bb_var(s) on it
- - -
-
-
-
2026-10-28
AdrianF
Under Review
[2/3] oeqa/utils/commands: use get_bb_vars_flags in get_bb_var
oeqa/utils/commands: add get_bb_vars_flags and build get_bb_var(s) on it
- - -
-
-
-
2026-10-28
AdrianF
Under Review
[1/3] oeqa/utils/commands: add get_bb_vars_flags
oeqa/utils/commands: add get_bb_vars_flags and build get_bb_var(s) on it
- - -
-
-
-
2026-10-28
AdrianF
Under Review
[poky,scarthgap,v2] systemd: try AT_EMPTY_PATH for access_fd() first
[poky,scarthgap,v2] systemd: try AT_EMPTY_PATH for access_fd() first
- - -
-
-
-
2026-10-28
Suresh H A
ycongal_smile
Under Review
dropbear: don't delete host keys during package updates
dropbear: don't delete host keys during package updates
- - -
-
-
-
2026-10-28
Koen Kooi
Under Review
[RFC,v2] pkcs11-provider: import version 1.3.0 from meta-oe
[RFC,v2] pkcs11-provider: import version 1.3.0 from meta-oe
- - -
-
-
-
2026-10-28
Ayoub Zaki
New
libjpeg-turbo: Upgrade 3.2.0 -> 3.2.1
libjpeg-turbo: Upgrade 3.2.0 -> 3.2.1
- - -
-
-
-
2026-10-28
Jaipaul Cheernam
Under Review
[wrynose] recipe_sanity: Drop rename overwrite detection
[wrynose] recipe_sanity: Drop rename overwrite detection
- - -
-
-
-
2026-10-28
Anuj Mittal
ycongal_smile
New
[3/3] buildtools-docs-tarball: add nativesdk-python3-sphinx-tags
Add python3-sphinx-tags recipe to buildtools-docs-tarball
- - -
-
-
-
2026-10-28
Antonin Godard
Under Review
[2/3] python3-sphinx-tags: add recipe
Add python3-sphinx-tags recipe to buildtools-docs-tarball
- - -
-
-
-
2026-10-28
Antonin Godard
Under Review
[1/3] python3-sphinx-design: add recipe
Add python3-sphinx-tags recipe to buildtools-docs-tarball
- - -
-
-
-
2026-10-28
Antonin Godard
Under Review
[8/8] python3-pdm: upgrade 2.29.2 -> 2.29.4
Upgrades on 28th October
- - -
-
-
-
2026-10-28
Jaipaul Cheernam
Under Review
[7/8] python3-hypothesis: upgrade 6.170.8 -> 6.170.12
Upgrades on 28th October
- - -
-
-
-
2026-10-28
Jaipaul Cheernam
Under Review
[6/8] repo: upgrade 2.69 -> 2.71
Upgrades on 28th October
- - -
-
-
-
2026-10-28
Jaipaul Cheernam
Under Review
[4/8] python3-pytest: upgrade 9.1.1 -> 9.2.0
Upgrades on 28th October
- - -
-
-
-
2026-10-28
Jaipaul Cheernam
Under Review
[3/8] python3-pyasn1: upgrade 0.6.4 -> 0.6.5
Upgrades on 28th October
- - -
-
-
-
2026-10-28
Jaipaul Cheernam
Under Review
[2/8] createrepo-c: upgrade 1.2.5 -> 1.2.6
Upgrades on 28th October
- - -
-
-
-
2026-10-28
Jaipaul Cheernam
Under Review
[1/8] cmake,cmake-native: upgrade 4.4.4 -> 4.4.5
Upgrades on 28th October
- - -
-
-
-
2026-10-28
Jaipaul Cheernam
Under Review
[AUH] python3-pytest: upgrading to 9.2.0 SUCCEEDED
[AUH] python3-pytest: upgrading to 9.2.0 SUCCEEDED
- - -
-
-
-
2026-10-28
auh@yoctoproject.org
New
[AUH] python3-pyasn1: upgrading to 0.6.5 SUCCEEDED
[AUH] python3-pyasn1: upgrading to 0.6.5 SUCCEEDED
- - -
-
-
-
2026-10-28
auh@yoctoproject.org
New
[AUH] python3-flit-core: upgrading to 4.2.0 SUCCEEDED
[AUH] python3-flit-core: upgrading to 4.2.0 SUCCEEDED
- - -
-
-
-
2026-10-28
auh@yoctoproject.org
New
[AUH] repo: upgrading to 2.71 SUCCEEDED
[AUH] repo: upgrading to 2.71 SUCCEEDED
- - -
-
-
-
2026-10-28
auh@yoctoproject.org
New
[AUH] python3-hatchling: upgrading to 1.33.0 SUCCEEDED
[AUH] python3-hatchling: upgrading to 1.33.0 SUCCEEDED
- - -
-
-
-
2026-10-28
auh@yoctoproject.org
New
[AUH] createrepo-c: upgrading to 1.2.6 SUCCEEDED
[AUH] createrepo-c: upgrading to 1.2.6 SUCCEEDED
- - -
-
-
-
2026-10-28
auh@yoctoproject.org
New
[AUH] cmake-native,cmake: upgrading to 4.4.5 SUCCEEDED
[AUH] cmake-native,cmake: upgrading to 4.4.5 SUCCEEDED
- - -
-
-
-
2026-10-28
auh@yoctoproject.org
New
musl: Keep clang from raising spurious FP exceptions
musl: Keep clang from raising spurious FP exceptions
- - -
-
-
-
2026-10-28
Khem Raj
Under Review
lrzsz: Fix build with clang 23
lrzsz: Fix build with clang 23
- - -
-
-
-
2026-10-28
Khem Raj
Under Review
[v6,7/7] layer.conf: Fix initramfs-framework not knowing which udev it has
Implement SPDX for deploy tasks
- - -
-
-
-
2026-10-27
Joshua Watt
Under Review
[v6,6/7] spdx: Replace do_create_image_spdx with deploy task
Implement SPDX for deploy tasks
- - -
-
-
-
2026-10-27
Joshua Watt
Under Review
[v6,5/7] classes-recipe/deploy: Add do_deploy to SPDX_DEPLOY_TASKS
Implement SPDX for deploy tasks
- - -
-
-
-
2026-10-27
Joshua Watt
Under Review
[v6,4/7] classes-global/sstate: Keep SPDX generating setscene dependencies
Implement SPDX for deploy tasks
- - -
-
-
-
2026-10-27
Joshua Watt
Under Review
[v6,3/7] oeqa: Add SPDX deploy SBoM test
Implement SPDX for deploy tasks
- - -
-
-
-
2026-10-27
Joshua Watt
Under Review
[v6,2/7] spdx: Add ability for deploy tasks to create SPDX
Implement SPDX for deploy tasks
- - -
-
-
-
2026-10-27
Joshua Watt
Under Review
[v6,1/7] spdx: Skip dependencies that are not in the taskhash
Implement SPDX for deploy tasks
- - -
-
-
-
2026-10-27
Joshua Watt
Under Review
clang: Remap lambda paths in declaration template arguments
clang: Remap lambda paths in declaration template arguments
- - -
-
-
-
2026-10-27
Khem Raj
Under Review
«
1
2
3
4
…
157
158
»