Toggle navigation
Patchwork
OpenEmbedded Core Layer
Patches
Bundles
About this project
Login
Register
Mail settings
Show patches with
: none
| 51237 patches
Series
Submitter
State
any
Action Required
New
Under Review
Accepted
Rejected
RFC
Not Applicable
Changes Requested
Awaiting Upstream
Superseded
Deferred
Search
Archived
No
Yes
Both
Delegate
------
Nobody
gitpwbot
gitpwbot
gitpwbot
gitpwbot
gitpwbot
gitpwbot
gitpwbot
gitpwbot
mototimo
mototimo
mototimo
kraj
kraj
denix
denix
reatmon
reatmon
rpurdie
rpurdie
rpurdie
rpurdie
sakoman
ycongal_smile
ycongal_smile
ycongal_smile
rossburton
rossburton
jonmason
abelloni
abelloni
agodard
mathieu
anujm
fatho
fatho
fatho
boucman
boucman
boucman
Apply
«
1
2
3
4
…
512
513
»
Patch
Series
A/R/T
S/W/F
Date
Submitter
Delegate
State
[2/2] sqlite3: Add support for the unlock notify API, and enable it for target
[1/2] sqlite3: Squash sqlite3.inc into the recipe
- - -
-
-
-
2026-09-25
Peter Kjellerstedt
New
[1/2] sqlite3: Squash sqlite3.inc into the recipe
[1/2] sqlite3: Squash sqlite3.inc into the recipe
- - -
-
-
-
2026-09-25
Peter Kjellerstedt
New
lame: add context to patches
lame: add context to patches
- - -
-
-
-
2026-09-25
Ross Burton
Accepted
compiler-rt: Use specific arm architecture instead of 'arm'
compiler-rt: Use specific arm architecture instead of 'arm'
- - -
-
-
-
2026-09-25
Jan Strater-Büddefeld
New
[2/2] python3-dtschema-wrapper: remove obsolete recipe
[1/2] linux-yocto-dev: drop DeviceTree validation dependencies
1 - -
-
-
-
2026-09-25
Ross Burton
New
[1/2] linux-yocto-dev: drop DeviceTree validation dependencies
[1/2] linux-yocto-dev: drop DeviceTree validation dependencies
- - -
-
-
-
2026-09-25
Ross Burton
New
gcr: remove now-redundant gnome_verdir() replacement
gcr: remove now-redundant gnome_verdir() replacement
- - -
-
-
-
2026-09-25
Ross Burton
New
[v2] gstreamer: skip test_queue:test_leaky_downstream test as it's flakey
[v2] gstreamer: skip test_queue:test_leaky_downstream test as it's flakey
- - -
-
-
-
2026-09-25
Ross Burton
New
wget: fix CVE-2026-15146
wget: fix CVE-2026-15146
- - -
-
-
-
2026-09-25
Ghanshyam Banait
New
clang/llvm: Upgrade to 23.1.2 release
clang/llvm: Upgrade to 23.1.2 release
- - -
-
-
-
2026-09-25
Varatharajan, Deepesh
New
gstreamer: skip test_queue:test_leaky_downstream test as it's flakey
gstreamer: skip test_queue:test_leaky_downstream test as it's flakey
- - -
-
-
-
2026-09-25
Ross Burton
New
[v2,2/2] scripts/contrib: add spdx-release-date-report.py
[v2,1/2] create-spdx-3.0: record component release date in SPDX output
- - -
-
-
-
2026-09-25
Daniel Turull
New
[v2,1/2] create-spdx-3.0: record component release date in SPDX output
[v2,1/2] create-spdx-3.0: record component release date in SPDX output
- - -
-
-
-
2026-09-25
Daniel Turull
New
rt-tests/hwlatdetect: upgrade 2.10 -> 2.11
rt-tests/hwlatdetect: upgrade 2.10 -> 2.11
- - -
-
-
-
2026-09-25
Jaipaul Cheernam
New
[1/2] rt-tests: drop Makefile CC/AR patch and use EXTRA_OEMAKE
[1/2] rt-tests: drop Makefile CC/AR patch and use EXTRA_OEMAKE
- - -
-
-
-
2026-09-25
Jaipaul Cheernam
New
[v3] tiff: add ptest support
[v3] tiff: add ptest support
- - -
-
-
-
2026-09-25
Himani Ramesh Barde
New
[AUH] parted: upgrading to 3.8 SUCCEEDED
[AUH] parted: upgrading to 3.8 SUCCEEDED
- - -
-
-
-
2026-09-25
auh@yoctoproject.org
New
[AUH] epiphany: upgrading to 51.1 SUCCEEDED
[AUH] epiphany: upgrading to 51.1 SUCCEEDED
- - -
-
-
-
2026-09-25
auh@yoctoproject.org
New
[AUH] libuv: upgrading to 1.53.0 SUCCEEDED
[AUH] libuv: upgrading to 1.53.0 SUCCEEDED
- - -
-
-
-
2026-09-25
auh@yoctoproject.org
New
[AUH] libpam: upgrading to 1.7.3 SUCCEEDED
[AUH] libpam: upgrading to 1.7.3 SUCCEEDED
- - -
-
-
-
2026-09-25
auh@yoctoproject.org
New
[AUH] python3-uv-build: upgrading to 0.12.19 SUCCEEDED
[AUH] python3-uv-build: upgrading to 0.12.19 SUCCEEDED
- - -
-
-
-
2026-09-25
auh@yoctoproject.org
New
libx11: stage the X11 locale data in the native sysroot
libx11: stage the X11 locale data in the native sysroot
- - -
-
-
-
2026-09-25
Markus Volk
New
go: skip internal/cgrouptest when cpu.max is not available
go: skip internal/cgrouptest when cpu.max is not available
- - -
-
-
-
2026-09-25
Khem Raj
New
go: skip internal/cgrouptest when cpu.max is not available
go: skip internal/cgrouptest when cpu.max is not available
- - -
-
-
-
2026-09-25
Khem Raj
New
xxhash: inherit lib_package
xxhash: inherit lib_package
- - -
-
-
-
2026-09-24
Ross Burton
New
[4/4] dwarfsrcfiles: remove
[1/4] lib/oe/package: remove unused and optional fatal argument to source_info()
- - -
-
-
-
2026-09-24
Ross Burton
New
[3/4] classes/package: use eu-srcfiles instead of dwarfsrcfiles
[1/4] lib/oe/package: remove unused and optional fatal argument to source_info()
- - -
-
-
-
2026-09-24
Ross Burton
New
[2/4] elfutils: fix handling of DWARF5 compilation units
[1/4] lib/oe/package: remove unused and optional fatal argument to source_info()
- - -
-
-
-
2026-09-24
Ross Burton
New
[1/4] lib/oe/package: remove unused and optional fatal argument to source_info()
[1/4] lib/oe/package: remove unused and optional fatal argument to source_info()
- - -
-
-
-
2026-09-24
Ross Burton
New
gcc: Fix configargs.h build arch contamination
gcc: Fix configargs.h build arch contamination
- - -
-
-
-
2026-09-24
Richard Purdie
Accepted
[v4] systemd: backport fix for limits.h override
[v4] systemd: backport fix for limits.h override
- - -
-
-
-
2026-09-24
Jaipaul Cheernam
New
[scarthgap,v2,2/2] python3-pyasn1: fix CVE-2026-59885
[OE-core[scarthgap,v2,1/2] python3-pyasn1: fix CVE-2026-30922
- - -
-
-
-
2026-09-24
Yogita Urade
ycongal_smile
New
[OE-core[scarthgap,v2,1/2] python3-pyasn1: fix CVE-2026-30922
[OE-core[scarthgap,v2,1/2] python3-pyasn1: fix CVE-2026-30922
- - -
-
-
-
2026-09-24
Yogita Urade
New
python3: ptest: skip flaky test_staggered_race_with_eager_tasks
python3: ptest: skip flaky test_staggered_race_with_eager_tasks
- - -
-
-
-
2026-09-24
Pratik Farkase
New
[wrynose,v2,00/78] Pull request (cover letter only)
- - -
-
-
-
2026-09-24
Yoann Congal
Not Applicable
go-mod-update-modules: Combine env with fetcher environment
go-mod-update-modules: Combine env with fetcher environment
- - -
-
-
-
2026-09-24
Michal Sieron
New
[v3] systemd: fix musl build by fixing limits.h override
[v3] systemd: fix musl build by fixing limits.h override
- - -
-
-
-
2026-09-24
Ross Burton
New
[scarthgap,v2] glibc: Fix CVE-2026-6238
[scarthgap,v2] glibc: Fix CVE-2026-6238
- - -
-
-
-
2026-09-24
Varatharajan, Deepesh
ycongal_smile
New
[v2] kernel-fit-image: remove fatal error when .crt file is missing
[v2] kernel-fit-image: remove fatal error when .crt file is missing
- - -
-
-
-
2026-09-24
Tobias Pistora
New
remove fatal error when .crt file is missing at fitimage sanity check
remove fatal error when .crt file is missing at fitimage sanity check
- - -
-
-
-
2026-09-24
Tobias Pistora
New
barebox: install generated dtbs
barebox: install generated dtbs
- - -
-
-
-
2026-09-24
Fabian Pfitzner
New
[2/2] devtool: ide-sdk: allow ide plugins to add packages rootfs-dbg
[1/2] devtool: ide-sdk: make nfs export script quicker
- - -
-
-
-
2026-09-24
Freihofer, Adrian
New
[1/2] devtool: ide-sdk: make nfs export script quicker
[1/2] devtool: ide-sdk: make nfs export script quicker
- - -
-
-
-
2026-09-24
Freihofer, Adrian
New
[AUH] repo: upgrading to 2.68.1 SUCCEEDED
[AUH] repo: upgrading to 2.68.1 SUCCEEDED
- - -
-
-
-
2026-09-24
auh@yoctoproject.org
New
[AUH] gnupg: upgrading to 2.5.24 SUCCEEDED
[AUH] gnupg: upgrading to 2.5.24 SUCCEEDED
- - -
-
-
-
2026-09-24
auh@yoctoproject.org
New
[AUH] python3-vcs-versioning: upgrading to 2.5.0 SUCCEEDED
[AUH] python3-vcs-versioning: upgrading to 2.5.0 SUCCEEDED
- - -
-
-
-
2026-09-24
auh@yoctoproject.org
New
[AUH] python3-wcwidth: upgrading to 0.9.1 SUCCEEDED
[AUH] python3-wcwidth: upgrading to 0.9.1 SUCCEEDED
- - -
-
-
-
2026-09-24
auh@yoctoproject.org
New
[AUH] shadow: upgrading to 4.20.3 FAILED
[AUH] shadow: upgrading to 4.20.3 FAILED
- - -
-
-
-
2026-09-24
auh@yoctoproject.org
New
[AUH] python3-setuptools-scm: upgrading to 10.3.4 FAILED
[AUH] python3-setuptools-scm: upgrading to 10.3.4 FAILED
- - -
-
-
-
2026-09-24
auh@yoctoproject.org
New
[AUH] python3-pytz: upgrading to 2026.4 SUCCEEDED
[AUH] python3-pytz: upgrading to 2026.4 SUCCEEDED
- - -
-
-
-
2026-09-24
auh@yoctoproject.org
New
[v2,3/3] oe/package.py: copydebugsources: add all kernel source files
Fix kernel complementary package installation
- - -
-
-
-
2026-09-23
Freihofer, Adrian
New
[v2,2/3] core-image.bbclass: do not pull the kernel -src package in via complementary packages
Fix kernel complementary package installation
- - -
-
-
-
2026-09-23
Freihofer, Adrian
New
[v2,1/3] kernel.bbclass: make the -src package installable on purpose
Fix kernel complementary package installation
- - -
-
-
-
2026-09-23
Freihofer, Adrian
New
[13/13] selftest: resulttooltests.py: add min-duration default test
resulttool: add 'durations' subcommand and selftests
- - -
-
-
-
2026-09-23
Trevor Gamblin
New
[12/13] selftest: resulttooltests.py: add short-tables ordering test
resulttool: add 'durations' subcommand and selftests
- - -
-
-
-
2026-09-23
Trevor Gamblin
New
[11/13] selftest: resulttooltests.py: add limit-after-sort test
resulttool: add 'durations' subcommand and selftests
- - -
-
-
-
2026-09-23
Trevor Gamblin
New
[10/13] selftest: resulttooltests.py: add sort-by-delta test
resulttool: add 'durations' subcommand and selftests
- - -
-
-
-
2026-09-23
Trevor Gamblin
New
[09/13] selftest: resulttooltests.py: add None-pct threshold test
resulttool: add 'durations' subcommand and selftests
- - -
-
-
-
2026-09-23
Trevor Gamblin
New
[08/13] selftest: resulttooltests.py: add multi-pair threshold test
resulttool: add 'durations' subcommand and selftests
- - -
-
-
-
2026-09-23
Trevor Gamblin
New
[07/13] selftest: resulttooltests.py: add threshold-disabled test
resulttool: add 'durations' subcommand and selftests
- - -
-
-
-
2026-09-23
Trevor Gamblin
New
[06/13] selftest: resulttooltests.py: add threshold filtering test
resulttool: add 'durations' subcommand and selftests
- - -
-
-
-
2026-09-23
Trevor Gamblin
New
[05/13] selftest: resulttooltests.py: add consecutive-pair delta test
resulttool: add 'durations' subcommand and selftests
- - -
-
-
-
2026-09-23
Trevor Gamblin
New
[04/13] selftest: resulttooltests.py: add zero-round pct suppression test
resulttool: add 'durations' subcommand and selftests
- - -
-
-
-
2026-09-23
Trevor Gamblin
New
[03/13] selftest: resulttooltests.py: add report-log Time(s) column test
resulttool: add 'durations' subcommand and selftests
- - -
-
-
-
2026-09-23
Trevor Gamblin
New
[02/13] selftest: resulttooltests.py: add basic durations test
resulttool: add 'durations' subcommand and selftests
- - -
-
-
-
2026-09-23
Trevor Gamblin
New
[01/13] scripts: resulttool: add 'durations' option
resulttool: add 'durations' subcommand and selftests
- - -
-
-
-
2026-09-23
Trevor Gamblin
New
[scarthgap] u-boot-tools: use all patches from u-boot
[scarthgap] u-boot-tools: use all patches from u-boot
- - -
-
-
-
2026-09-23
Marko, Peter
ycongal_smile
New
classes/gnomebase: improve gnome_verdir() logic
classes/gnomebase: improve gnome_verdir() logic
- - -
-
-
-
2026-09-23
Ross Burton
Accepted
coreutils: Upgrade 9.11 -> 9.12
coreutils: Upgrade 9.11 -> 9.12
- - -
-
-
-
2026-09-23
Leon Anavi
New
[6/6] python3-pdm-backend: upgrade 2.4.9 -> 2.4.10
[1/6] gnupg: upgrade 2.5.22 -> 2.5.23
- - -
-
-
-
2026-09-23
Richard Purdie
Accepted
[5/6] python3-mako: upgrade 1.4.1 -> 1.4.3
[1/6] gnupg: upgrade 2.5.22 -> 2.5.23
- - -
-
-
-
2026-09-23
Richard Purdie
Accepted
[4/6] python3-hypothesis: upgrade 6.168.0 -> 6.168.1
[1/6] gnupg: upgrade 2.5.22 -> 2.5.23
- - -
-
-
-
2026-09-23
Richard Purdie
Accepted
[3/6] meson: upgrade 1.12.0 -> 1.12.1
[1/6] gnupg: upgrade 2.5.22 -> 2.5.23
- - -
-
-
-
2026-09-23
Richard Purdie
Accepted
[2/6] libslirp: upgrade 4.9.4 -> 4.9.5
[1/6] gnupg: upgrade 2.5.22 -> 2.5.23
- - -
-
-
-
2026-09-23
Richard Purdie
Accepted
[1/6] gnupg: upgrade 2.5.22 -> 2.5.23
[1/6] gnupg: upgrade 2.5.22 -> 2.5.23
- - -
-
-
-
2026-09-23
Richard Purdie
Accepted
libinput: Upgrade 1.31.3 -> 1.32.0
libinput: Upgrade 1.31.3 -> 1.32.0
- - -
-
-
-
2026-09-23
Jaipaul Cheernam
Accepted
layer.conf: Drop wrynose from CORENAMES ready for release
layer.conf: Drop wrynose from CORENAMES ready for release
- - -
-
-
-
2026-09-23
Richard Purdie
Accepted
[scarthgap,48/48] time64: enable 64-bit time/file-offset flags for 32-bit nativesdk
[scarthgap,01/48] wireless-regdb: upgrade 2026.05.30 -> 2026.09.03
- - -
-
-
-
2026-09-23
Yoann Congal
ycongal_smile
RFC
[scarthgap,47/48] curl: set CVE_STATUS for CVE-2026-82209
[scarthgap,01/48] wireless-regdb: upgrade 2026.05.30 -> 2026.09.03
- - -
-
-
-
2026-09-23
Yoann Congal
ycongal_smile
RFC
[scarthgap,46/48] curl: Security Fix for CVE-2026-18924
[scarthgap,01/48] wireless-regdb: upgrade 2026.05.30 -> 2026.09.03
- - -
-
-
-
2026-09-23
Yoann Congal
ycongal_smile
RFC
[scarthgap,45/48] curl: Security Fix for CVE-2026-13608
[scarthgap,01/48] wireless-regdb: upgrade 2026.05.30 -> 2026.09.03
- - -
-
-
-
2026-09-23
Yoann Congal
ycongal_smile
RFC
[scarthgap,44/48] python3-cryptography: Fix CVE-2026-69249
[scarthgap,01/48] wireless-regdb: upgrade 2026.05.30 -> 2026.09.03
- - -
-
-
-
2026-09-23
Yoann Congal
ycongal_smile
RFC
[scarthgap,43/48] python3-cryptography: Fix CVE-2026-69248
[scarthgap,01/48] wireless-regdb: upgrade 2026.05.30 -> 2026.09.03
- - -
-
-
-
2026-09-23
Yoann Congal
ycongal_smile
RFC
[scarthgap,42/48] python3-cryptography: Fix CVE-2026-34073
[scarthgap,01/48] wireless-regdb: upgrade 2026.05.30 -> 2026.09.03
- - -
-
-
-
2026-09-23
Yoann Congal
ycongal_smile
RFC
[scarthgap,41/48] rootfs.py: fix run-postinsts removal on multilib images
[scarthgap,01/48] wireless-regdb: upgrade 2026.05.30 -> 2026.09.03
- - -
-
-
-
2026-09-23
Yoann Congal
ycongal_smile
RFC
[scarthgap,40/48] libslirp: patch CVE-2026-9539
[scarthgap,01/48] wireless-regdb: upgrade 2026.05.30 -> 2026.09.03
- - -
-
-
-
2026-09-23
Yoann Congal
ycongal_smile
RFC
[scarthgap,39/48] pseudo: 1.9.10 -> 1.9.11
[scarthgap,01/48] wireless-regdb: upgrade 2026.05.30 -> 2026.09.03
- - -
-
-
-
2026-09-23
Yoann Congal
ycongal_smile
RFC
[scarthgap,38/48] pseudo: Update to 1.9.10
[scarthgap,01/48] wireless-regdb: upgrade 2026.05.30 -> 2026.09.03
- - -
-
-
-
2026-09-23
Yoann Congal
ycongal_smile
RFC
[scarthgap,37/48] pseudo: Add in openat2, exec and linkat fixes
[scarthgap,01/48] wireless-regdb: upgrade 2026.05.30 -> 2026.09.03
- - -
-
-
-
2026-09-23
Yoann Congal
ycongal_smile
RFC
[scarthgap,36/48] ptest-runner: Upgrade 2.5.0 -> 2.5.1
[scarthgap,01/48] wireless-regdb: upgrade 2026.05.30 -> 2026.09.03
- - -
-
-
-
2026-09-23
Yoann Congal
ycongal_smile
RFC
[scarthgap,35/48] ptest-runner: Upgrade 2.4.5.1 -> 2.5.0
[scarthgap,01/48] wireless-regdb: upgrade 2026.05.30 -> 2026.09.03
- - -
-
-
-
2026-09-23
Yoann Congal
ycongal_smile
RFC
[scarthgap,34/48] ptest-runner: upgrade 2.4.5 -> 2.4.5.1
[scarthgap,01/48] wireless-regdb: upgrade 2026.05.30 -> 2026.09.03
- - -
-
-
-
2026-09-23
Yoann Congal
ycongal_smile
RFC
[scarthgap,33/48] python3: skip ptest incompatible with ptest-runner >= 2.5.0
[scarthgap,01/48] wireless-regdb: upgrade 2026.05.30 -> 2026.09.03
- - -
-
-
-
2026-09-23
Yoann Congal
ycongal_smile
RFC
[scarthgap,32/48] spdx30_tasks: Fix SPDX_CUSTOM_ANNOTATION_VARS implementation
[scarthgap,01/48] wireless-regdb: upgrade 2026.05.30 -> 2026.09.03
- - -
-
-
-
2026-09-23
Yoann Congal
ycongal_smile
RFC
[scarthgap,31/48] scripts/install-buildtools: Update to 5.0.20
[scarthgap,01/48] wireless-regdb: upgrade 2026.05.30 -> 2026.09.03
- - -
-
-
-
2026-09-23
Yoann Congal
ycongal_smile
RFC
[scarthgap,30/48] python3-git: fix CVE-2026-42215
[scarthgap,01/48] wireless-regdb: upgrade 2026.05.30 -> 2026.09.03
- - -
-
-
-
2026-09-23
Yoann Congal
ycongal_smile
RFC
[scarthgap,29/48] gcc: Upgrade to GCC 13.5
[scarthgap,01/48] wireless-regdb: upgrade 2026.05.30 -> 2026.09.03
- - -
-
-
-
2026-09-23
Yoann Congal
ycongal_smile
RFC
[scarthgap,28/48] python3-certifi: fix homepage
[scarthgap,01/48] wireless-regdb: upgrade 2026.05.30 -> 2026.09.03
- - -
-
-
-
2026-09-23
Yoann Congal
ycongal_smile
RFC
[scarthgap,27/48] golang: fix homepage
[scarthgap,01/48] wireless-regdb: upgrade 2026.05.30 -> 2026.09.03
- - -
-
-
-
2026-09-23
Yoann Congal
ycongal_smile
RFC
[scarthgap,26/48] libxfont: Fix CVE-2026-56003
[scarthgap,01/48] wireless-regdb: upgrade 2026.05.30 -> 2026.09.03
- - -
-
-
-
2026-09-23
Yoann Congal
ycongal_smile
RFC
«
1
2
3
4
…
512
513
»