Toggle navigation
Patchwork
OpenEmbedded Core Layer
Patches
Bundles
About this project
Login
Register
Mail settings
Show patches with
: State =
Action Required
| 17350 patches
Series
Submitter
State
any
Action Required
New
Under Review
Accepted
Rejected
RFC
Not Applicable
Changes Requested
Awaiting Upstream
Superseded
Deferred
Search
Archived
No
Yes
Both
Delegate
------
Nobody
gitpwbot
gitpwbot
gitpwbot
gitpwbot
gitpwbot
gitpwbot
gitpwbot
gitpwbot
mototimo
mototimo
mototimo
kraj
kraj
denix
denix
reatmon
reatmon
rpurdie
rpurdie
rpurdie
rpurdie
sakoman
ycongal_smile
ycongal_smile
ycongal_smile
rossburton
rossburton
jonmason
abelloni
abelloni
agodard
mathieu
anujm
fatho
fatho
fatho
boucman
boucman
boucman
Apply
«
1
2
3
4
…
173
174
»
Patch
Series
A/R/T
S/W/F
Date
Submitter
Delegate
State
[wrynose,2/2] nasm: fix CVE-2026-6068
[wrynose,1/2] nasm: fix CVE-2026-6067
- - -
-
-
-
2026-10-14
Kris Gavvala
New
[wrynose,1/2] nasm: fix CVE-2026-6067
[wrynose,1/2] nasm: fix CVE-2026-6067
- - -
-
-
-
2026-10-14
Kris Gavvala
New
curl: upgrade 8.22.0 -> 8.23.0
curl: upgrade 8.22.0 -> 8.23.0
- - -
-
-
-
2026-10-14
Peter Marko
New
[scarthgap,v2,5/5] libsoup-2.4: fix CVE-2026-3633
[scarthgap,v2,1/5] libsoup-2.4: fix CVE-2026-1539
- - -
-
-
-
2026-10-14
Jason Stasiak
New
[scarthgap,v2,4/5] libsoup-2.4: fix CVE-2026-5119
[scarthgap,v2,1/5] libsoup-2.4: fix CVE-2026-1539
- - -
-
-
-
2026-10-14
Jason Stasiak
New
[scarthgap,v2,3/5] libsoup-2.4: fix CVE-2026-2443
[scarthgap,v2,1/5] libsoup-2.4: fix CVE-2026-1539
- - -
-
-
-
2026-10-14
Jason Stasiak
New
[scarthgap,v2,2/5] libsoup-2.4: fix CVE-2026-1801
[scarthgap,v2,1/5] libsoup-2.4: fix CVE-2026-1539
- - -
-
-
-
2026-10-14
Jason Stasiak
New
[scarthgap,v2,1/5] libsoup-2.4: fix CVE-2026-1539
[scarthgap,v2,1/5] libsoup-2.4: fix CVE-2026-1539
- - -
-
-
-
2026-10-14
Jason Stasiak
New
python3-markdown: upgrade 3.11 -> 3.11.1
python3-markdown: upgrade 3.11 -> 3.11.1
- - -
-
-
-
2026-10-14
Jaipaul Cheernam
Under Review
python3-flit-core: upgrade 3.12.0 -> 4.1.0
python3-flit-core: upgrade 3.12.0 -> 4.1.0
- - -
-
-
-
2026-10-14
Jaipaul Cheernam
Under Review
[RFC] pkcs11-provider: add version 1.3.0
[RFC] pkcs11-provider: add version 1.3.0
- - -
-
-
-
2026-10-14
Ayoub Zaki
New
[4/4] python3-installer: upgrade 1.0.1 -> 1.1.0
[1/4] freetype: upgrade 2.14.3 -> 2.15.0
- - -
-
-
-
2026-10-14
Ross Burton
Under Review
[3/4] pkgconf: upgrade 3.0.7 -> 3.0.8
[1/4] freetype: upgrade 2.14.3 -> 2.15.0
- - -
-
-
-
2026-10-14
Ross Burton
Under Review
[1/4] freetype: upgrade 2.14.3 -> 2.15.0
[1/4] freetype: upgrade 2.14.3 -> 2.15.0
- - -
-
-
-
2026-10-14
Ross Burton
Under Review
[scarthgap,v3,7/7] libpcap: Fix CVE-2026-18238
libpcap: backport seven CVE fixes from 1.10.7
- - -
-
-
-
2026-10-14
Jaipaul Cheernam
ycongal_smile
Under Review
[scarthgap,v3,6/7] libpcap: Fix CVE-2026-18313
libpcap: backport seven CVE fixes from 1.10.7
- - -
-
-
-
2026-10-14
Jaipaul Cheernam
ycongal_smile
Under Review
[scarthgap,v3,5/7] libpcap: Fix CVE-2026-6554
libpcap: backport seven CVE fixes from 1.10.7
- - -
-
-
-
2026-10-14
Jaipaul Cheernam
ycongal_smile
Under Review
[scarthgap,v3,4/7] libpcap: Fix CVE-2026-6244
libpcap: backport seven CVE fixes from 1.10.7
- - -
-
-
-
2026-10-14
Jaipaul Cheernam
ycongal_smile
Under Review
[scarthgap,v3,3/7] libpcap: Fix CVE-2026-31911
libpcap: backport seven CVE fixes from 1.10.7
- - -
-
-
-
2026-10-14
Jaipaul Cheernam
ycongal_smile
Under Review
[scarthgap,v3,2/7] libpcap: Fix CVE-2026-31912
libpcap: backport seven CVE fixes from 1.10.7
- - -
-
-
-
2026-10-14
Jaipaul Cheernam
ycongal_smile
Under Review
[scarthgap,v3,1/7] libpcap: Fix CVE-2026-0799
libpcap: backport seven CVE fixes from 1.10.7
- - -
-
-
-
2026-10-14
Jaipaul Cheernam
ycongal_smile
Under Review
[v3,3/7] libpcap: Fix CVE-2026-31911
[v3,1/7] libpcap: Fix CVE-2026-0799
- - -
-
-
-
2026-10-14
Jaipaul Cheernam
New
[v3,2/7] libpcap: Fix CVE-2026-31912
[v3,1/7] libpcap: Fix CVE-2026-0799
- - -
-
-
-
2026-10-14
Jaipaul Cheernam
New
[v3,1/7] libpcap: Fix CVE-2026-0799
[v3,1/7] libpcap: Fix CVE-2026-0799
- - -
-
-
-
2026-10-14
Jaipaul Cheernam
New
[v3] libsoup: add ptest support
[v3] libsoup: add ptest support
- - -
-
-
-
2026-10-14
Pratik Farkase
Under Review
[v2] python3-jsonpointer: upgrade 3.1.1 -> 3.2.1
[v2] python3-jsonpointer: upgrade 3.1.1 -> 3.2.1
- - -
-
-
-
2026-10-14
Jaipaul Cheernam
New
python3-packaging: refresh patch
python3-packaging: refresh patch
- - -
-
-
-
2026-10-14
Ross Burton
Under Review
[v2,2/2] python3-uv-build: Upgrade 0.12.21 -> 0.13.0
[v2,1/2] python3-cryptography-vectors: allow uv-build 0.13.0
- - -
-
-
-
2026-10-14
Jaipaul Cheernam
Under Review
[v2,1/2] python3-cryptography-vectors: allow uv-build 0.13.0
[v2,1/2] python3-cryptography-vectors: allow uv-build 0.13.0
- - -
-
-
-
2026-10-14
Jaipaul Cheernam
Under Review
[AUH] python3-more-itertools: upgrading to 11.2.0 FAILED
[AUH] python3-more-itertools: upgrading to 11.2.0 FAILED
- - -
-
-
-
2026-10-14
auh@yoctoproject.org
New
[AUH] python3-markdown: upgrading to 3.11.1 SUCCEEDED
[AUH] python3-markdown: upgrading to 3.11.1 SUCCEEDED
- - -
-
-
-
2026-10-14
auh@yoctoproject.org
New
[AUH] python3-hypothesis: upgrading to 6.169.1 SUCCEEDED
[AUH] python3-hypothesis: upgrading to 6.169.1 SUCCEEDED
- - -
-
-
-
2026-10-14
auh@yoctoproject.org
New
[AUH] createrepo-c: upgrading to 1.2.5 SUCCEEDED
[AUH] createrepo-c: upgrading to 1.2.5 SUCCEEDED
- - -
-
-
-
2026-10-14
auh@yoctoproject.org
New
[v2] testimage: add TESTIMAGE_AUTO_SKIP_IMAGES
[v2] testimage: add TESTIMAGE_AUTO_SKIP_IMAGES
- - -
-
-
-
2026-10-13
Jose Quaresma
Under Review
[2/2] python3-subunit: Upgrade 1.4.4 -> 1.4.6
[1/2] python3-testtools: Add native
- - -
-
-
-
2026-10-13
Leon Anavi
Under Review
[1/2] python3-testtools: Add native
[1/2] python3-testtools: Add native
- - -
-
-
-
2026-10-13
Leon Anavi
Under Review
[scarthgap,v2] connman: fix syslog identity with glibc
[scarthgap,v2] connman: fix syslog identity with glibc
- - -
-
-
-
2026-10-13
Gaël PORTAY
ycongal_smile
Under Review
[wrynose,v4] u-boot: fix CVE-2026-29009
[wrynose,v4] u-boot: fix CVE-2026-29009
- - -
-
-
-
2026-10-13
Roopa Kalmath
New
[4/4] oeqa/selftest: check the font caches an image ships are used
fontcache: make the caches built into an image valid
- - -
-
-
-
2026-10-13
Alex Kiernan
Under Review
[3/4] image_types: keep the rootfs mtimes in ext2/3/4 images
fontcache: make the caches built into an image valid
- - -
-
-
-
2026-10-13
Alex Kiernan
Under Review
[2/4] update_font_cache: write caches that are valid in the final image
fontcache: make the caches built into an image valid
- - -
-
-
-
2026-10-13
Alex Kiernan
Under Review
[1/4] package_manager: pass REPRODUCIBLE_TIMESTAMP_ROOTFS to intercepts
fontcache: make the caches built into an image valid
- - -
-
-
-
2026-10-13
Alex Kiernan
Under Review
createrepo-c: upgrade 1.2.4 -> 1.2.5
createrepo-c: upgrade 1.2.4 -> 1.2.5
- - -
-
-
-
2026-10-13
Moritz Haase
Under Review
[AUH] libjitterentropy: upgrading to 3.7.0 FAILED
[AUH] libjitterentropy: upgrading to 3.7.0 FAILED
- - -
-
-
-
2026-10-13
auh@yoctoproject.org
New
[AUH] piglit: upgrading to f73c2b554e565d6ee3fa2a331c60236141a73768 SUCCEEDED
[AUH] piglit: upgrading to f73c2b554e565d6ee3fa2a331c60236141a73768 SUCCEEDED
- - -
-
-
-
2026-10-13
auh@yoctoproject.org
New
[AUH] freetype: upgrading to 2.15.0 SUCCEEDED
[AUH] freetype: upgrading to 2.15.0 SUCCEEDED
- - -
-
-
-
2026-10-13
auh@yoctoproject.org
New
[AUH] python3-installer: upgrading to 1.1.0 SUCCEEDED
[AUH] python3-installer: upgrading to 1.1.0 SUCCEEDED
- - -
-
-
-
2026-10-13
auh@yoctoproject.org
New
[AUH] gn: upgrading to 0817afa577428da457b6482c027d7202cd01fcbf SUCCEEDED
[AUH] gn: upgrading to 0817afa577428da457b6482c027d7202cd01fcbf SUCCEEDED
- - -
-
-
-
2026-10-13
auh@yoctoproject.org
New
[blacksail] gcc: Fix for CVE-2026-102010
[blacksail] gcc: Fix for CVE-2026-102010
- - -
-
-
-
2026-10-12
Peter Marko
ycongal_smile
New
[wrynose] glib-2.0: upgrade 2.88.2 -> 2.88.3
[wrynose] glib-2.0: upgrade 2.88.2 -> 2.88.3
- - -
-
-
-
2026-10-12
Peter Marko
New
[blacksail] glibc: stable 2.44 branch updates to 34106fee69
[blacksail] glibc: stable 2.44 branch updates to 34106fee69
- - -
-
-
-
2026-10-12
Peter Marko
ycongal_smile
New
[v2,10/10] gstreamer1.0-rtsp-server: Upgrade 1.28.7 -> 1.28.8
gstreamer, gst-examples and gst-devtools upgrades
- - -
-
-
-
2026-10-12
Jaipaul Cheernam
Under Review
[v2,09/10] gstreamer1.0-plugins-ugly: Upgrade 1.28.7 -> 1.28.8
gstreamer, gst-examples and gst-devtools upgrades
- - -
-
-
-
2026-10-12
Jaipaul Cheernam
Under Review
[v2,08/10] gstreamer1.0-plugins-good: Upgrade 1.28.7 -> 1.28.8
gstreamer, gst-examples and gst-devtools upgrades
- - -
-
-
-
2026-10-12
Jaipaul Cheernam
Under Review
[v2,07/10] gstreamer1.0-plugins-base: upgrade 1.28.7 -> 1.28.8
gstreamer, gst-examples and gst-devtools upgrades
- - -
-
-
-
2026-10-12
Jaipaul Cheernam
Under Review
[v2,06/10] gstreamer1.0-plugins-bad: upgrade 1.28.7 -> 1.28.8
gstreamer, gst-examples and gst-devtools upgrades
- - -
-
-
-
2026-10-12
Jaipaul Cheernam
Under Review
[v2,05/10] gstreamer1.0-libav: upgrade 1.28.7 -> 1.28.8
gstreamer, gst-examples and gst-devtools upgrades
- - -
-
-
-
2026-10-12
Jaipaul Cheernam
Under Review
[v2,04/10] gst-devtools: upgrade 1.28.7 -> 1.28.8
gstreamer, gst-examples and gst-devtools upgrades
- - -
-
-
-
2026-10-12
Jaipaul Cheernam
Under Review
[v2,03/10] gst-examples: upgrade 1.28.7 -> 1.28.8
gstreamer, gst-examples and gst-devtools upgrades
- - -
-
-
-
2026-10-12
Jaipaul Cheernam
Under Review
[v2,02/10] gstreamer1.0-python: upgrade 1.28.7 -> 1.28.8
gstreamer, gst-examples and gst-devtools upgrades
- - -
-
-
-
2026-10-12
Jaipaul Cheernam
Under Review
[v2,01/10] gstreamer1.0: upgrade 1.28.7 -> 1.28.8
gstreamer, gst-examples and gst-devtools upgrades
- - -
-
-
-
2026-10-12
Jaipaul Cheernam
Under Review
sqlite3: use SOLIBS and SOLIBSDEV in FILES
sqlite3: use SOLIBS and SOLIBSDEV in FILES
- - -
-
-
-
2026-10-12
Etienne Cordonnier
Under Review
[2/2] gtk+3: add PACKAGECONFIG for demos and examples
[1/2] adwaita-icon-theme: drop librsvg-native DEPENDS
- - -
-
-
-
2026-10-12
Ross Burton
Under Review
[1/2] adwaita-icon-theme: drop librsvg-native DEPENDS
[1/2] adwaita-icon-theme: drop librsvg-native DEPENDS
- - -
-
-
-
2026-10-12
Ross Burton
Under Review
[18/18] python3-beartype: Upgrade 0.23.0 -> 0.23.1
Upgrades on 12th October
- - -
-
-
-
2026-10-12
Jaipaul Cheernam
Under Review
[17/18] python3-hypothesis: upgrade 6.168.5 -> 6.169.0
Upgrades on 12th October
- - -
-
-
-
2026-10-12
Jaipaul Cheernam
Under Review
[16/18] python3-pycryptodome,python3-pycryptodomex: upgrade 3.23.0 -> 3.24.1
Upgrades on 12th October
- - -
-
-
-
2026-10-12
Jaipaul Cheernam
Under Review
[15/18] python3-numpy: upgrade 2.5.3 -> 2.5.4
Upgrades on 12th October
- - -
-
-
-
2026-10-12
Jaipaul Cheernam
Under Review
[14/18] at-spi2-core: upgrade 2.62.0.1 -> 2.62.1
Upgrades on 12th October
- - -
-
-
-
2026-10-12
Jaipaul Cheernam
Under Review
[13/18] python3-beartype: upgrade 0.22.9 -> 0.23.0
Upgrades on 12th October
- - -
-
-
-
2026-10-12
Jaipaul Cheernam
Under Review
[11/18] sqlite3: upgrade 3.53.4 -> 3.54.0
Upgrades on 12th October
- - -
-
-
-
2026-10-12
Jaipaul Cheernam
Under Review
[10/18] python3-pygobject: upgrade 3.58.0 -> 3.58.1
Upgrades on 12th October
- - -
-
-
-
2026-10-12
Jaipaul Cheernam
Under Review
[09/18] fastfloat: upgrade 8.3.0 -> 8.3.2
Upgrades on 12th October
- - -
-
-
-
2026-10-12
Jaipaul Cheernam
Under Review
[03/18] python3-pycparser: Upgrade 3.0 -> 3.11
Upgrades on 12th October
- - -
-
-
-
2026-10-12
Jaipaul Cheernam
Under Review
[01/18] pkgconf: upgrade 3.0.7 -> 3.0.8
Upgrades on 12th October
- - -
-
-
-
2026-10-12
Jaipaul Cheernam
Under Review
[v5,3/3] scripts/contrib: add spdx-release-date-report.py
spdx: add support to include releaseTime
- - -
-
-
-
2026-10-12
Daniel Turull
Under Review
[v5,2/3] create-spdx-3.0: record component release date in SPDX output
spdx: add support to include releaseTime
- - -
-
-
-
2026-10-12
Daniel Turull
Under Review
[v5,1/3] classes/base: exclude __CACHED_SOURCE_DATE_EPOCH from task hash
spdx: add support to include releaseTime
- - -
-
-
-
2026-10-12
Daniel Turull
Under Review
[wrynose,v2] libarchive: fix CVE-2026-15028
[wrynose,v2] libarchive: fix CVE-2026-15028
- - -
-
-
-
2026-10-12
Jakub Szczudlo
ycongal_smile
New
[WRYNOSE,v2] gstreamer1.0-plugins-bad: use gtk+3 dependency name
[WRYNOSE,v2] gstreamer1.0-plugins-bad: use gtk+3 dependency name
- - -
-
-
-
2026-10-12
Tushar Darote
ycongal_smile
New
patch: add ptest support
patch: add ptest support
- - -
-
-
-
2026-10-12
Pratik Farkase
Under Review
rust: Squash rust-cross-canadian.inc into the recipe
rust: Squash rust-cross-canadian.inc into the recipe
- - -
-
-
-
2026-10-12
Deepesh Varatharajan
Under Review
clang/llvm: Upgrade to 23.1.3 release
clang/llvm: Upgrade to 23.1.3 release
- - -
-
-
-
2026-10-12
Deepesh Varatharajan
Under Review
[wrynose] gcc: Fix for CVE-2026-102010
[wrynose] gcc: Fix for CVE-2026-102010
- - -
-
-
-
2026-10-12
Hemanth Kumar M D
ycongal_smile
New
cargo-c: upgrade 0.10.25 -> 0.10.26
cargo-c: upgrade 0.10.25 -> 0.10.26
- - -
-
-
-
2026-10-12
Deepesh Varatharajan
Under Review
[wrynose] tzdata/tzcode-native: upgrade 2026d -> 2026e
[wrynose] tzdata/tzcode-native: upgrade 2026d -> 2026e
- - -
-
-
-
2026-10-12
Vijay Anusuri
ycongal_smile
New
[AUH] python3-beartype: upgrading to 0.23.1 SUCCEEDED
[AUH] python3-beartype: upgrading to 0.23.1 SUCCEEDED
- - -
-
-
-
2026-10-12
auh@yoctoproject.org
New
[AUH] python3-hypothesis: upgrading to 6.169.0 SUCCEEDED
[AUH] python3-hypothesis: upgrading to 6.169.0 SUCCEEDED
- - -
-
-
-
2026-10-12
auh@yoctoproject.org
New
[AUH] python3-pycryptodome,python3-pycryptodomex: upgrading to 3.24.1 SUCCEEDED
[AUH] python3-pycryptodome,python3-pycryptodomex: upgrading to 3.24.1 SUCCEEDED
- - -
-
-
-
2026-10-12
auh@yoctoproject.org
New
[blacksail,2/2] expat: patch CVE-2026-77214
[blacksail,1/2] expat: patch CVE-2026-102633
- - -
-
-
-
2026-10-11
Peter Marko
ycongal_smile
New
[blacksail,1/2] expat: patch CVE-2026-102633
[blacksail,1/2] expat: patch CVE-2026-102633
- - -
-
-
-
2026-10-11
Peter Marko
ycongal_smile
New
[AUH] python3-numpy: upgrading to 2.5.4 SUCCEEDED
[AUH] python3-numpy: upgrading to 2.5.4 SUCCEEDED
- - -
-
-
-
2026-10-11
auh@yoctoproject.org
New
[AUH] at-spi2-core: upgrading to 2.62.1 SUCCEEDED
[AUH] at-spi2-core: upgrading to 2.62.1 SUCCEEDED
- - -
-
-
-
2026-10-11
auh@yoctoproject.org
New
[AUH] python3-jsonpointer: upgrading to 3.2.1 SUCCEEDED
[AUH] python3-jsonpointer: upgrading to 3.2.1 SUCCEEDED
- - -
-
-
-
2026-10-11
auh@yoctoproject.org
New
[AUH] python3-beartype: upgrading to 0.23.0 SUCCEEDED
[AUH] python3-beartype: upgrading to 0.23.0 SUCCEEDED
- - -
-
-
-
2026-10-11
auh@yoctoproject.org
New
[v2] ptest-packagelists: Skip dbus ptest when dbus-broker is the dbus provider
[v2] ptest-packagelists: Skip dbus ptest when dbus-broker is the dbus provider
- - -
-
-
-
2026-10-10
Khem Raj
Under Review
[AUH] python3-uv-build: upgrading to 0.13.0 SUCCEEDED
[AUH] python3-uv-build: upgrading to 0.13.0 SUCCEEDED
- - -
-
-
-
2026-10-10
auh@yoctoproject.org
New
[AUH] python3-pygobject: upgrading to 3.58.1 SUCCEEDED
[AUH] python3-pygobject: upgrading to 3.58.1 SUCCEEDED
- - -
-
-
-
2026-10-10
auh@yoctoproject.org
New
[AUH] sqlite3: upgrading to 3.54.0 SUCCEEDED
[AUH] sqlite3: upgrading to 3.54.0 SUCCEEDED
- - -
-
-
-
2026-10-10
auh@yoctoproject.org
New
[AUH] python3-pycparser: upgrading to 3.11 SUCCEEDED
[AUH] python3-pycparser: upgrading to 3.11 SUCCEEDED
- - -
-
-
-
2026-10-10
auh@yoctoproject.org
New
«
1
2
3
4
…
173
174
»