Toggle navigation
Patchwork
OpenEmbedded Core Layer
Patches
Bundles
About this project
Login
Register
Mail settings
Show patches with
: State =
Action Required
| 17334 patches
Series
Submitter
State
any
Action Required
New
Under Review
Accepted
Rejected
RFC
Not Applicable
Changes Requested
Awaiting Upstream
Superseded
Deferred
Search
Archived
No
Yes
Both
Delegate
------
Nobody
gitpwbot
gitpwbot
gitpwbot
gitpwbot
gitpwbot
gitpwbot
gitpwbot
gitpwbot
mototimo
mototimo
mototimo
kraj
kraj
denix
denix
reatmon
reatmon
rpurdie
rpurdie
rpurdie
rpurdie
sakoman
ycongal_smile
ycongal_smile
ycongal_smile
rossburton
rossburton
jonmason
abelloni
abelloni
agodard
mathieu
anujm
fatho
fatho
fatho
boucman
boucman
boucman
Apply
«
1
2
3
4
…
173
174
»
Patch
Series
A/R/T
S/W/F
Date
Submitter
Delegate
State
[v3] python3-more-itertools: upgrade 10.8.0 -> 11.1.0
[v3] python3-more-itertools: upgrade 10.8.0 -> 11.1.0
- - -
-
-
-
2026-10-15
Jaipaul Cheernam
New
[v10,3/3] libdnf: remove recipe
[v10,1/3] rpm: add 0017-critically-fail-if-post-install-fails.patch
- - -
-
-
-
2026-10-15
Adam Duskett
New
[v10,2/3] dnf: Upgrade to 5.4.6.0
[v10,1/3] rpm: add 0017-critically-fail-if-post-install-fails.patch
- - -
-
-
-
2026-10-15
Adam Duskett
New
[v10,1/3] rpm: add 0017-critically-fail-if-post-install-fails.patch
[v10,1/3] rpm: add 0017-critically-fail-if-post-install-fails.patch
- - -
-
-
-
2026-10-15
Adam Duskett
New
python3-pyelftools: add missing runtime dependencies
python3-pyelftools: add missing runtime dependencies
- 2 -
-
-
-
2026-10-15
tgaige.opensource@witekio.com
New
[2/2] eudev: upgrade 3.2.14 -> 3.2.15
eudev: upgrade 3.2.14 -> 3.2.15
- - -
-
-
-
2026-10-15
Alex Kiernan
Under Review
[1/2] base-passwd: add the render group for eudev-3.2.15
eudev: upgrade 3.2.14 -> 3.2.15
- - -
-
-
-
2026-10-15
Alex Kiernan
Under Review
[scarthgap,v3,5/5] apr-util: Fix CVE-2026-34502
[scarthgap,v3,1/5] apr-util: Fix CVE-2025-49506
- - -
-
-
-
2026-10-15
Hetvi Thakar -X (hthakar - E INFOCHIPS PRIVATE LIMITED at Cisco)
New
[scarthgap,v3,4/5] apr-util: Fix CVE-2026-34501
[scarthgap,v3,1/5] apr-util: Fix CVE-2025-49506
- - -
-
-
-
2026-10-15
Hetvi Thakar -X (hthakar - E INFOCHIPS PRIVATE LIMITED at Cisco)
New
[scarthgap,v3,3/5] apr-util: Mark CVE-2026-34191 not applicable
[scarthgap,v3,1/5] apr-util: Fix CVE-2025-49506
- - -
-
-
-
2026-10-15
Hetvi Thakar -X (hthakar - E INFOCHIPS PRIVATE LIMITED at Cisco)
New
[scarthgap,v3,2/5] apr-util: Fix CVE-2026-32327
[scarthgap,v3,1/5] apr-util: Fix CVE-2025-49506
- - -
-
-
-
2026-10-15
Hetvi Thakar -X (hthakar - E INFOCHIPS PRIVATE LIMITED at Cisco)
New
[scarthgap,v3,1/5] apr-util: Fix CVE-2025-49506
[scarthgap,v3,1/5] apr-util: Fix CVE-2025-49506
- - -
-
-
-
2026-10-15
Hetvi Thakar -X (hthakar - E INFOCHIPS PRIVATE LIMITED at Cisco)
New
maintainers.inc: assign iptables and ca-certificates
maintainers.inc: assign iptables and ca-certificates
- - -
-
-
-
2026-10-15
Anders Heimer
Under Review
[v2] curl: upgrade 8.22.0 -> 8.23.0
[v2] curl: upgrade 8.22.0 -> 8.23.0
- - -
-
-
-
2026-10-15
Peter Marko
Under Review
[AUH] curl: upgrading to 8.23.0 FAILED
[AUH] curl: upgrading to 8.23.0 FAILED
- - -
-
-
-
2026-10-15
auh@yoctoproject.org
New
[AUH] libzip: upgrading to 1.12.1 SUCCEEDED
[AUH] libzip: upgrading to 1.12.1 SUCCEEDED
- - -
-
-
-
2026-10-15
auh@yoctoproject.org
New
[AUH] repo: upgrading to 2.69 SUCCEEDED
[AUH] repo: upgrading to 2.69 SUCCEEDED
- - -
-
-
-
2026-10-15
auh@yoctoproject.org
New
[AUH] python3-hypothesis: upgrading to 6.169.3 SUCCEEDED
[AUH] python3-hypothesis: upgrading to 6.169.3 SUCCEEDED
- - -
-
-
-
2026-10-15
auh@yoctoproject.org
New
[AUH] python3-uv-build: upgrading to 0.13.1 SUCCEEDED
[AUH] python3-uv-build: upgrading to 0.13.1 SUCCEEDED
- - -
-
-
-
2026-10-15
auh@yoctoproject.org
New
[AUH] python3-more-itertools: upgrading to 11.2.1 FAILED
[AUH] python3-more-itertools: upgrading to 11.2.1 FAILED
- - -
-
-
-
2026-10-15
auh@yoctoproject.org
New
[AUH] python3-git: upgrading to 3.2.1 SUCCEEDED
[AUH] python3-git: upgrading to 3.2.1 SUCCEEDED
- - -
-
-
-
2026-10-15
auh@yoctoproject.org
New
[AUH] python3-pycryptodome,python3-pycryptodomex: upgrading to 4.0.0,3.24.1 FAILED
[AUH] python3-pycryptodome,python3-pycryptodomex: upgrading to 4.0.0,3.24.1 FAILED
- - -
-
-
-
2026-10-15
auh@yoctoproject.org
New
[AUH] mesa,mesa-tools-native: upgrading to 26.2.5 SUCCEEDED
[AUH] mesa,mesa-tools-native: upgrading to 26.2.5 SUCCEEDED
- - -
-
-
-
2026-10-15
auh@yoctoproject.org
New
[wrynose,2/2] nasm: fix CVE-2026-6068
[wrynose,1/2] nasm: fix CVE-2026-6067
- - -
-
-
-
2026-10-14
Kris Gavvala
New
[wrynose,1/2] nasm: fix CVE-2026-6067
[wrynose,1/2] nasm: fix CVE-2026-6067
- - -
-
-
-
2026-10-14
Kris Gavvala
New
curl: upgrade 8.22.0 -> 8.23.0
curl: upgrade 8.22.0 -> 8.23.0
- - -
-
-
-
2026-10-14
Peter Marko
New
[scarthgap,v2,5/5] libsoup-2.4: fix CVE-2026-3633
[scarthgap,v2,1/5] libsoup-2.4: fix CVE-2026-1539
- - -
-
-
-
2026-10-14
Jason Stasiak
ycongal_smile
New
[scarthgap,v2,4/5] libsoup-2.4: fix CVE-2026-5119
[scarthgap,v2,1/5] libsoup-2.4: fix CVE-2026-1539
- - -
-
-
-
2026-10-14
Jason Stasiak
ycongal_smile
New
[scarthgap,v2,3/5] libsoup-2.4: fix CVE-2026-2443
[scarthgap,v2,1/5] libsoup-2.4: fix CVE-2026-1539
- - -
-
-
-
2026-10-14
Jason Stasiak
ycongal_smile
New
[scarthgap,v2,2/5] libsoup-2.4: fix CVE-2026-1801
[scarthgap,v2,1/5] libsoup-2.4: fix CVE-2026-1539
- - -
-
-
-
2026-10-14
Jason Stasiak
ycongal_smile
New
[scarthgap,v2,1/5] libsoup-2.4: fix CVE-2026-1539
[scarthgap,v2,1/5] libsoup-2.4: fix CVE-2026-1539
- - -
-
-
-
2026-10-14
Jason Stasiak
ycongal_smile
New
python3-markdown: upgrade 3.11 -> 3.11.1
python3-markdown: upgrade 3.11 -> 3.11.1
- - -
-
-
-
2026-10-14
Jaipaul Cheernam
Under Review
[RFC] pkcs11-provider: add version 1.3.0
[RFC] pkcs11-provider: add version 1.3.0
- - -
-
-
-
2026-10-14
Ayoub Zaki
New
[4/4] python3-installer: upgrade 1.0.1 -> 1.1.0
[1/4] freetype: upgrade 2.14.3 -> 2.15.0
- - -
-
-
-
2026-10-14
Ross Burton
Under Review
[1/4] freetype: upgrade 2.14.3 -> 2.15.0
[1/4] freetype: upgrade 2.14.3 -> 2.15.0
- - -
-
-
-
2026-10-14
Ross Burton
Under Review
[scarthgap,v3,7/7] libpcap: Fix CVE-2026-18238
libpcap: backport seven CVE fixes from 1.10.7
- - -
-
-
-
2026-10-14
Jaipaul Cheernam
ycongal_smile
Under Review
[scarthgap,v3,6/7] libpcap: Fix CVE-2026-18313
libpcap: backport seven CVE fixes from 1.10.7
- - -
-
-
-
2026-10-14
Jaipaul Cheernam
ycongal_smile
Under Review
[scarthgap,v3,5/7] libpcap: Fix CVE-2026-6554
libpcap: backport seven CVE fixes from 1.10.7
- - -
-
-
-
2026-10-14
Jaipaul Cheernam
ycongal_smile
Under Review
[scarthgap,v3,4/7] libpcap: Fix CVE-2026-6244
libpcap: backport seven CVE fixes from 1.10.7
- - -
-
-
-
2026-10-14
Jaipaul Cheernam
ycongal_smile
Under Review
[scarthgap,v3,3/7] libpcap: Fix CVE-2026-31911
libpcap: backport seven CVE fixes from 1.10.7
- - -
-
-
-
2026-10-14
Jaipaul Cheernam
ycongal_smile
Under Review
[scarthgap,v3,2/7] libpcap: Fix CVE-2026-31912
libpcap: backport seven CVE fixes from 1.10.7
- - -
-
-
-
2026-10-14
Jaipaul Cheernam
ycongal_smile
Under Review
[scarthgap,v3,1/7] libpcap: Fix CVE-2026-0799
libpcap: backport seven CVE fixes from 1.10.7
- - -
-
-
-
2026-10-14
Jaipaul Cheernam
ycongal_smile
Under Review
[v3,3/7] libpcap: Fix CVE-2026-31911
[v3,1/7] libpcap: Fix CVE-2026-0799
- - -
-
-
-
2026-10-14
Jaipaul Cheernam
New
[v3,2/7] libpcap: Fix CVE-2026-31912
[v3,1/7] libpcap: Fix CVE-2026-0799
- - -
-
-
-
2026-10-14
Jaipaul Cheernam
New
[v3,1/7] libpcap: Fix CVE-2026-0799
[v3,1/7] libpcap: Fix CVE-2026-0799
- - -
-
-
-
2026-10-14
Jaipaul Cheernam
New
[v3] libsoup: add ptest support
[v3] libsoup: add ptest support
- - -
-
-
-
2026-10-14
Pratik Farkase
Under Review
[v2] python3-jsonpointer: upgrade 3.1.1 -> 3.2.1
[v2] python3-jsonpointer: upgrade 3.1.1 -> 3.2.1
- - -
-
-
-
2026-10-14
Jaipaul Cheernam
New
[AUH] python3-more-itertools: upgrading to 11.2.0 FAILED
[AUH] python3-more-itertools: upgrading to 11.2.0 FAILED
- - -
-
-
-
2026-10-14
auh@yoctoproject.org
New
[AUH] python3-markdown: upgrading to 3.11.1 SUCCEEDED
[AUH] python3-markdown: upgrading to 3.11.1 SUCCEEDED
- - -
-
-
-
2026-10-14
auh@yoctoproject.org
New
[AUH] python3-hypothesis: upgrading to 6.169.1 SUCCEEDED
[AUH] python3-hypothesis: upgrading to 6.169.1 SUCCEEDED
- - -
-
-
-
2026-10-14
auh@yoctoproject.org
New
[AUH] createrepo-c: upgrading to 1.2.5 SUCCEEDED
[AUH] createrepo-c: upgrading to 1.2.5 SUCCEEDED
- - -
-
-
-
2026-10-14
auh@yoctoproject.org
New
[2/2] python3-subunit: Upgrade 1.4.4 -> 1.4.6
[1/2] python3-testtools: Add native
- - -
-
-
-
2026-10-13
Leon Anavi
Under Review
[1/2] python3-testtools: Add native
[1/2] python3-testtools: Add native
- - -
-
-
-
2026-10-13
Leon Anavi
Under Review
[scarthgap,v2] connman: fix syslog identity with glibc
[scarthgap,v2] connman: fix syslog identity with glibc
- - -
-
-
-
2026-10-13
Gaël PORTAY
ycongal_smile
Under Review
[wrynose,v4] u-boot: fix CVE-2026-29009
[wrynose,v4] u-boot: fix CVE-2026-29009
- - -
-
-
-
2026-10-13
Roopa Kalmath
New
[4/4] oeqa/selftest: check the font caches an image ships are used
fontcache: make the caches built into an image valid
- - -
-
-
-
2026-10-13
Alex Kiernan
Under Review
[3/4] image_types: keep the rootfs mtimes in ext2/3/4 images
fontcache: make the caches built into an image valid
- - -
-
-
-
2026-10-13
Alex Kiernan
Under Review
[2/4] update_font_cache: write caches that are valid in the final image
fontcache: make the caches built into an image valid
- - -
-
-
-
2026-10-13
Alex Kiernan
Under Review
[AUH] libjitterentropy: upgrading to 3.7.0 FAILED
[AUH] libjitterentropy: upgrading to 3.7.0 FAILED
- - -
-
-
-
2026-10-13
auh@yoctoproject.org
New
[AUH] piglit: upgrading to f73c2b554e565d6ee3fa2a331c60236141a73768 SUCCEEDED
[AUH] piglit: upgrading to f73c2b554e565d6ee3fa2a331c60236141a73768 SUCCEEDED
- - -
-
-
-
2026-10-13
auh@yoctoproject.org
New
[AUH] freetype: upgrading to 2.15.0 SUCCEEDED
[AUH] freetype: upgrading to 2.15.0 SUCCEEDED
- - -
-
-
-
2026-10-13
auh@yoctoproject.org
New
[AUH] python3-installer: upgrading to 1.1.0 SUCCEEDED
[AUH] python3-installer: upgrading to 1.1.0 SUCCEEDED
- - -
-
-
-
2026-10-13
auh@yoctoproject.org
New
[AUH] gn: upgrading to 0817afa577428da457b6482c027d7202cd01fcbf SUCCEEDED
[AUH] gn: upgrading to 0817afa577428da457b6482c027d7202cd01fcbf SUCCEEDED
- - -
-
-
-
2026-10-13
auh@yoctoproject.org
New
[blacksail] gcc: Fix for CVE-2026-102010
[blacksail] gcc: Fix for CVE-2026-102010
- - -
-
-
-
2026-10-12
Peter Marko
ycongal_smile
Under Review
[wrynose] glib-2.0: upgrade 2.88.2 -> 2.88.3
[wrynose] glib-2.0: upgrade 2.88.2 -> 2.88.3
- - -
-
-
-
2026-10-12
Peter Marko
New
[blacksail] glibc: stable 2.44 branch updates to 34106fee69
[blacksail] glibc: stable 2.44 branch updates to 34106fee69
- - -
-
-
-
2026-10-12
Peter Marko
ycongal_smile
Under Review
[v5,3/3] scripts/contrib: add spdx-release-date-report.py
spdx: add support to include releaseTime
- - -
-
-
-
2026-10-12
Daniel Turull
Under Review
[v5,2/3] create-spdx-3.0: record component release date in SPDX output
spdx: add support to include releaseTime
- - -
-
-
-
2026-10-12
Daniel Turull
Under Review
[v5,1/3] classes/base: exclude __CACHED_SOURCE_DATE_EPOCH from task hash
spdx: add support to include releaseTime
- - -
-
-
-
2026-10-12
Daniel Turull
Under Review
[wrynose,v2] libarchive: fix CVE-2026-15028
[wrynose,v2] libarchive: fix CVE-2026-15028
- - -
-
-
-
2026-10-12
Jakub Szczudlo
ycongal_smile
New
[WRYNOSE,v2] gstreamer1.0-plugins-bad: use gtk+3 dependency name
[WRYNOSE,v2] gstreamer1.0-plugins-bad: use gtk+3 dependency name
- - -
-
-
-
2026-10-12
Tushar Darote
ycongal_smile
New
patch: add ptest support
patch: add ptest support
- - -
-
-
-
2026-10-12
Pratik Farkase
Under Review
rust: Squash rust-cross-canadian.inc into the recipe
rust: Squash rust-cross-canadian.inc into the recipe
- - -
-
-
-
2026-10-12
Deepesh Varatharajan
Under Review
[wrynose] gcc: Fix for CVE-2026-102010
[wrynose] gcc: Fix for CVE-2026-102010
- - -
-
-
-
2026-10-12
Hemanth Kumar M D
ycongal_smile
New
[wrynose] tzdata/tzcode-native: upgrade 2026d -> 2026e
[wrynose] tzdata/tzcode-native: upgrade 2026d -> 2026e
- - -
-
-
-
2026-10-12
Vijay Anusuri
ycongal_smile
New
[AUH] python3-beartype: upgrading to 0.23.1 SUCCEEDED
[AUH] python3-beartype: upgrading to 0.23.1 SUCCEEDED
- - -
-
-
-
2026-10-12
auh@yoctoproject.org
New
[AUH] python3-hypothesis: upgrading to 6.169.0 SUCCEEDED
[AUH] python3-hypothesis: upgrading to 6.169.0 SUCCEEDED
- - -
-
-
-
2026-10-12
auh@yoctoproject.org
New
[AUH] python3-pycryptodome,python3-pycryptodomex: upgrading to 3.24.1 SUCCEEDED
[AUH] python3-pycryptodome,python3-pycryptodomex: upgrading to 3.24.1 SUCCEEDED
- - -
-
-
-
2026-10-12
auh@yoctoproject.org
New
[blacksail,2/2] expat: patch CVE-2026-77214
[blacksail,1/2] expat: patch CVE-2026-102633
- - -
-
-
-
2026-10-11
Peter Marko
ycongal_smile
Under Review
[blacksail,1/2] expat: patch CVE-2026-102633
[blacksail,1/2] expat: patch CVE-2026-102633
- - -
-
-
-
2026-10-11
Peter Marko
ycongal_smile
Under Review
[AUH] python3-numpy: upgrading to 2.5.4 SUCCEEDED
[AUH] python3-numpy: upgrading to 2.5.4 SUCCEEDED
- - -
-
-
-
2026-10-11
auh@yoctoproject.org
New
[AUH] at-spi2-core: upgrading to 2.62.1 SUCCEEDED
[AUH] at-spi2-core: upgrading to 2.62.1 SUCCEEDED
- - -
-
-
-
2026-10-11
auh@yoctoproject.org
New
[AUH] python3-jsonpointer: upgrading to 3.2.1 SUCCEEDED
[AUH] python3-jsonpointer: upgrading to 3.2.1 SUCCEEDED
- - -
-
-
-
2026-10-11
auh@yoctoproject.org
New
[AUH] python3-beartype: upgrading to 0.23.0 SUCCEEDED
[AUH] python3-beartype: upgrading to 0.23.0 SUCCEEDED
- - -
-
-
-
2026-10-11
auh@yoctoproject.org
New
[v2] ptest-packagelists: Skip dbus ptest when dbus-broker is the dbus provider
[v2] ptest-packagelists: Skip dbus ptest when dbus-broker is the dbus provider
- - -
-
-
-
2026-10-10
Khem Raj
Under Review
[AUH] python3-uv-build: upgrading to 0.13.0 SUCCEEDED
[AUH] python3-uv-build: upgrading to 0.13.0 SUCCEEDED
- - -
-
-
-
2026-10-10
auh@yoctoproject.org
New
[AUH] python3-pygobject: upgrading to 3.58.1 SUCCEEDED
[AUH] python3-pygobject: upgrading to 3.58.1 SUCCEEDED
- - -
-
-
-
2026-10-10
auh@yoctoproject.org
New
[AUH] sqlite3: upgrading to 3.54.0 SUCCEEDED
[AUH] sqlite3: upgrading to 3.54.0 SUCCEEDED
- - -
-
-
-
2026-10-10
auh@yoctoproject.org
New
[AUH] python3-pycparser: upgrading to 3.11 SUCCEEDED
[AUH] python3-pycparser: upgrading to 3.11 SUCCEEDED
- - -
-
-
-
2026-10-10
auh@yoctoproject.org
New
[AUH] fastfloat: upgrading to 8.3.2 SUCCEEDED
[AUH] fastfloat: upgrading to 8.3.2 SUCCEEDED
- - -
-
-
-
2026-10-10
auh@yoctoproject.org
New
[scarthgap,PATCHv2] systemd: backport networkd route readiness fix from upstream
[scarthgap,PATCHv2] systemd: backport networkd route readiness fix from upstream
- - -
-
-
-
2026-10-09
Akash Hadke
ycongal_smile
Under Review
[wrynose] wget: fix CVE-2026-15146
[wrynose] wget: fix CVE-2026-15146
- - -
-
-
-
2026-10-09
Ghanshyam Banait
ycongal_smile
Under Review
[AUH] gstreamer1.0-libav: upgrading to 1.28.8 SUCCEEDED
[AUH] gstreamer1.0-libav: upgrading to 1.28.8 SUCCEEDED
- - -
-
-
-
2026-10-09
auh@yoctoproject.org
New
[AUH] gstreamer1.0: upgrading to 1.28.8 SUCCEEDED
[AUH] gstreamer1.0: upgrading to 1.28.8 SUCCEEDED
- - -
-
-
-
2026-10-09
auh@yoctoproject.org
New
[AUH] gstreamer1.0-python: upgrading to 1.28.8 SUCCEEDED
[AUH] gstreamer1.0-python: upgrading to 1.28.8 SUCCEEDED
- - -
-
-
-
2026-10-09
auh@yoctoproject.org
New
[AUH] gst-examples: upgrading to 1.28.8 SUCCEEDED
[AUH] gst-examples: upgrading to 1.28.8 SUCCEEDED
- - -
-
-
-
2026-10-09
auh@yoctoproject.org
New
[AUH] gst-devtools: upgrading to 1.28.8 SUCCEEDED
[AUH] gst-devtools: upgrading to 1.28.8 SUCCEEDED
- - -
-
-
-
2026-10-09
auh@yoctoproject.org
New
[AUH] python3-uv-build: upgrading to 0.12.24 SUCCEEDED
[AUH] python3-uv-build: upgrading to 0.12.24 SUCCEEDED
- - -
-
-
-
2026-10-09
auh@yoctoproject.org
New
[AUH] go-binary-native: upgrading to 1.27.2 SUCCEEDED
[AUH] go-binary-native: upgrading to 1.27.2 SUCCEEDED
- - -
-
-
-
2026-10-09
auh@yoctoproject.org
New
[AUH] python3-pycparser: upgrading to 3.1 SUCCEEDED
[AUH] python3-pycparser: upgrading to 3.1 SUCCEEDED
- - -
-
-
-
2026-10-09
auh@yoctoproject.org
New
«
1
2
3
4
…
173
174
»